program: Orca
programVersion: 5.0.2
elementType: I O O N C C C C C C C C H H H H H H H H H H H H
elementType: I
charge: 0
multiplicity: 1
keywords: wb97x-d3
keywords: def2-TZVPP
keywords: def2/J RIJCOSX
keywords: DEFGRID2
keywords: scfconv7
keywords: smallprint printgap noloewdin
keywords: NOSOSCF
formula: C8H12INO2
InChI: InChI=1/C8H12INO2/c1-2-3-6-10-8(11)12-7-4-5-9/h10H,2-3,6-7H2,1H3
24 atoms
I  2.90891 1.039949 0.952049
O  -2.069086 0.615322 -0.936752
O  -2.248893 -0.368052 1.084779
N  -2.752232 -1.485047 -0.831875
C  -4.732302 -2.688817 0.051903
C  -5.231777 -3.939473 0.769157
C  -3.231548 -2.703105 -0.21375
C  -5.001868 -5.234574 0.001951
C  -2.356954 -0.421017 -0.123464
C  -1.501521 1.762973 -0.322608
C  -0.124775 1.535252 0.096765
C  1.021584 1.357759 0.417454
H  -5.263309 -2.573346 -0.898577
H  -4.974969 -1.808231 0.653591
H  -6.301686 -3.82273 0.959145
H  -4.757725 -4.008398 1.752932
H  -2.965139 -3.524794 -0.878802
H  -2.683995 -2.86559 0.715801
H  -3.941521 -5.466038 -0.110056
H  -5.45994 -6.080556 0.516852
H  -5.435711 -5.187241 -0.999497
H  -2.847933 -1.389324 -1.831175
H  -1.527506 2.542237 -1.085334
H  -2.104759 2.109665 0.519679
elementType: I O N C H
totalener: -815.08329137 hartree
nucrepener: 789.58846459 hartree
electener: -1604.67175596 hartree
oneelecener: -2789.04370320 hartree
twoeener: 1184.37194724 hartree
cpcmener: -0.02476516 hartree
kineticenergy: 628.60325214 hartree
xcener: -65.066082439563 hartree
chargesum: 0.0000000
charge: 0.289179 -0.321386 -0.528406 -0.234219 -0.115234 -0.108302 -0.029536 -0.276851 0.510805 0.004396 -0.355910 -0.005157 0.067198 0.078929 0.068849 0.061199 0.105950 0.090448 0.081115 0.091342 0.080699 0.175176 0.131346 0.138371
qa: 0.2892 -0.3214 -0.5284 -0.2342 -0.1152 -0.1083 -0.0295 -0.2769 0.5108 0.0044 -0.3559 -0.0052 0.0672 0.0789 0.0688 0.0612 0.1060 0.0904 0.0811 0.0913 0.0807 0.1752 0.1313 0.1384
va: 1.2152 2.0775 1.9764 3.2046 3.8673 3.9015 3.8446 3.9337 4.2988 3.9386 4.0424 3.8260 1.0142 1.0200 1.0065 1.0076 1.0006 1.0173 0.9977 1.0044 0.9996 1.0162 0.9882 0.9997
dispcorr: -0.008014059 hartree
energy: -815.091305430411
dipole: -265.39859 265.07744 -0.32115 -114.54307 114.13167 -0.41140 -43.78850 42.50912 -1.27938
magnitude: 1.38174 au
magnitude: 3.51211 debye
