program: Orca
programVersion: 5.0.2
elementType: I O O N C C C C C C C C H H H H H H H H H H H H
elementType: I
charge: 0
multiplicity: 1
keywords: wb97x-d3
keywords: def2-TZVPP
keywords: def2/J RIJCOSX
keywords: DEFGRID2
keywords: scfconv7
keywords: smallprint printgap noloewdin
keywords: NOSOSCF
formula: C8H12INO2
InChI: InChI=1/C8H12INO2/c1-2-3-6-10-8(11)12-7-4-5-9/h10H,2-3,6-7H2,1H3
24 atoms
I  2.969248 0.593544 0.131418
O  -2.318412 1.487048 0.323977
O  -2.161096 0.006639 -1.37084
N  -3.59108 -0.317429 0.36956
C  -3.361985 -2.780258 0.569186
C  -3.989349 -4.128223 0.225887
C  -4.108773 -1.603116 -0.046052
C  -3.92746 -4.485851 -1.252899
C  -2.650918 0.346153 -0.313022
C  -1.332633 2.299522 -0.295153
C  0.007422 1.741976 -0.168481
C  1.127318 1.315153 -0.056288
H  -3.349104 -2.657226 1.656054
H  -2.318305 -2.760296 0.240084
H  -5.031066 -4.138585 0.562315
H  -3.481337 -4.905596 0.801909
H  -5.161045 -1.642755 0.24256
H  -4.083016 -1.648929 -1.134134
H  -4.49964 -3.793219 -1.872019
H  -2.898441 -4.479989 -1.618505
H  -4.332062 -5.483293 -1.431723
H  -3.869367 0.036302 1.272025
H  -1.567724 2.485833 -1.345777
H  -1.379826 3.257369 0.223872
elementType: I O N C H
totalener: -815.08338740 hartree
nucrepener: 797.16340458 hartree
electener: -1612.24679198 hartree
oneelecener: -2804.26054372 hartree
twoeener: 1192.01375173 hartree
cpcmener: -0.02484377 hartree
kineticenergy: 628.60313902 hartree
xcener: -65.066199451434 hartree
chargesum: -0.0000000
charge: 0.289100 -0.320641 -0.527841 -0.234321 -0.110125 -0.105951 -0.029135 -0.270313 0.513744 -0.001732 -0.357358 -0.001120 0.070772 0.071825 0.055142 0.070186 0.102141 0.088081 0.078750 0.081536 0.090142 0.175656 0.139603 0.131858
qa: 0.2891 -0.3206 -0.5278 -0.2343 -0.1101 -0.1060 -0.0291 -0.2703 0.5137 -0.0017 -0.3574 -0.0011 0.0708 0.0718 0.0551 0.0702 0.1021 0.0881 0.0787 0.0815 0.0901 0.1757 0.1396 0.1319
va: 1.2150 2.0755 1.9779 3.2057 3.8739 3.9028 3.8414 3.9309 4.2929 3.9457 4.0426 3.8258 1.0175 1.0167 1.0088 1.0065 1.0016 1.0187 0.9992 1.0007 1.0041 1.0157 0.9987 0.9880
dispcorr: -0.008057221 hartree
energy: -815.091444624756
dipole: -256.30117 255.62143 -0.67975 -71.27371 71.27151 -0.00219 -14.71729 15.95529 1.23800
magnitude: 1.41234 au
magnitude: 3.58988 debye
