program: Orca
programVersion: 5.0.2
elementType: I O O N C C C C C C C C H H H H H H H H H H H H
elementType: I
charge: 0
multiplicity: 1
keywords: wb97x-d3
keywords: def2-TZVPP
keywords: def2/J RIJCOSX
keywords: DEFGRID2
keywords: scfconv7
keywords: smallprint printgap noloewdin
keywords: NOSOSCF
formula: C8H12INO2
InChI: InChI=1/C8H12INO2/c1-2-3-6-10-8(11)12-7-4-5-9/h10H,2-3,6-7H2,1H3
24 atoms
I  2.516067 -0.058596 0.278771
O  -2.209311 1.968256 -0.91753
O  -2.467694 1.159225 1.171568
N  -3.588171 0.264197 -0.59306
C  -3.071156 -1.970549 0.386364
C  -2.413868 -2.526102 -0.87034
C  -4.110088 -0.886531 0.118995
C  -1.362124 -3.580076 -0.557921
C  -2.735218 1.118537 -0.011996
C  -1.108849 2.749827 -0.47188
C  0.058788 1.914702 -0.219834
C  0.99237 1.178442 -0.03066
H  -3.569774 -2.780175 0.928127
H  -2.302858 -1.583323 1.061444
H  -1.944923 -1.714319 -1.433987
H  -3.179919 -2.951808 -1.526278
H  -4.557186 -0.555249 1.057167
H  -4.922488 -1.287524 -0.487968
H  -0.907956 -3.97358 -1.468558
H  -0.558576 -3.1666 0.055156
H  -1.788672 -4.424171 -0.012234
H  -3.62523 0.249436 -1.600848
H  -0.901216 3.450899 -1.280584
H  -1.360723 3.336881 0.414336
elementType: I O N C H
totalener: -815.08305062 hartree
nucrepener: 837.27002920 hartree
electener: -1652.35307982 hartree
oneelecener: -2884.38454700 hartree
twoeener: 1232.03146719 hartree
cpcmener: -0.02415661 hartree
kineticenergy: 628.60598780 hartree
xcener: -65.065499744175 hartree
chargesum: -0.0000000
charge: 0.291974 -0.318502 -0.516983 -0.241418 -0.109891 -0.093302 -0.051672 -0.275644 0.502201 0.020751 -0.348964 -0.026430 0.076610 0.067037 0.057093 0.062052 0.104987 0.103952 0.089452 0.077802 0.079124 0.179906 0.132274 0.137590
qa: 0.2920 -0.3185 -0.5170 -0.2414 -0.1099 -0.0933 -0.0517 -0.2756 0.5022 0.0208 -0.3490 -0.0264 0.0766 0.0670 0.0571 0.0621 0.1050 0.1040 0.0895 0.0778 0.0791 0.1799 0.1323 0.1376
va: 1.2181 2.0712 1.9891 3.1812 3.7979 3.8609 3.8993 3.9513 4.3212 3.9163 4.0227 3.8434 1.0155 1.0231 1.0170 1.0071 1.0107 1.0024 1.0036 1.0016 1.0012 1.0109 0.9882 0.9995
dispcorr: -0.009368619 hartree
energy: -815.092419234838
dipole: -210.59431 210.38028 -0.21403 -8.68073 8.07843 -0.60231 -22.74960 21.45172 -1.29788
magnitude: 1.44675 au
magnitude: 3.67734 debye
