program: Orca
programVersion: 5.0.2
elementType: I O O N C C C C C C C C H H H H H H H H H H H H
elementType: I
charge: 0
multiplicity: 1
keywords: wb97x-d3
keywords: def2-TZVPP
keywords: def2/J RIJCOSX
keywords: DEFGRID2
keywords: scfconv7
keywords: smallprint printgap noloewdin
keywords: NOSOSCF
formula: C8H12INO2
InChI: InChI=1/C8H12INO2/c1-2-3-6-10-8(11)12-7-4-5-9/h10H,2-3,6-7H2,1H3
24 atoms
I  2.985469 1.215728 -1.113328
O  -1.995603 0.525774 0.732826
O  -2.022087 -0.785113 -1.101262
N  -2.590516 -1.592118 0.948713
C  -4.495324 -2.986282 0.182397
C  -4.913169 -4.381297 -0.261738
C  -3.011601 -2.906844 0.515241
C  -6.406187 -4.488203 -0.529252
C  -2.197925 -0.642002 0.091253
C  -1.521049 1.609415 -0.05265
C  -0.116503 1.46038 -0.408831
C  1.051863 1.363871 -0.680937
H  -4.729022 -2.262277 -0.603829
H  -5.075921 -2.690926 1.062046
H  -4.628505 -5.109118 0.504147
H  -4.358854 -4.657457 -1.163539
H  -2.411441 -3.202667 -0.345402
H  -2.771869 -3.608158 1.315625
H  -6.987116 -4.266163 0.367965
H  -6.72345 -3.789993 -1.305854
H  -6.681991 -5.49121 -0.858127
H  -2.771344 -1.329635 1.905581
H  -2.128089 1.750568 -0.949486
H  -1.647615 2.495661 0.569832
elementType: I O N C H
totalener: -815.08473506 hartree
nucrepener: 783.53705197 hartree
electener: -1598.62178703 hartree
oneelecener: -2776.94984346 hartree
twoeener: 1178.32805643 hartree
cpcmener: -0.02488887 hartree
kineticenergy: 628.61479264 hartree
xcener: -65.067260321529 hartree
chargesum: -0.0000000
charge: 0.289089 -0.320675 -0.528045 -0.236055 -0.101276 -0.091362 -0.024029 -0.271442 0.514410 0.001332 -0.356942 -0.002367 0.068324 0.060702 0.055510 0.061680 0.087862 0.100371 0.077591 0.079054 0.090285 0.175144 0.138901 0.131938
qa: 0.2891 -0.3207 -0.5280 -0.2361 -0.1013 -0.0914 -0.0240 -0.2714 0.5144 0.0013 -0.3569 -0.0024 0.0683 0.0607 0.0555 0.0617 0.0879 0.1004 0.0776 0.0791 0.0903 0.1751 0.1389 0.1319
va: 1.2144 2.0776 1.9767 3.2027 3.8554 3.8886 3.8618 3.9433 4.2941 3.9413 4.0455 3.8219 1.0178 1.0145 1.0079 1.0069 1.0193 1.0038 1.0010 1.0010 1.0041 1.0156 0.9998 0.9881
dispcorr: -0.007715092 hartree
energy: -815.092450149328
dipole: -271.53908 271.11524 -0.42385 -126.31185 126.15488 -0.15697 49.17611 -47.85680 1.31931
magnitude: 1.39459 au
magnitude: 3.54476 debye
