program: Orca
programVersion: 5.0.2
elementType: I O O N C C C C C C C C H H H H H H H H H H H H
elementType: I
charge: 0
multiplicity: 1
keywords: wb97x-d3
keywords: def2-TZVPP
keywords: def2/J RIJCOSX
keywords: DEFGRID2
keywords: scfconv7
keywords: smallprint printgap noloewdin
keywords: NOSOSCF
formula: C8H12INO2
InChI: InChI=1/C8H12INO2/c1-2-3-6-10-8(11)12-7-4-5-9/h10H,2-3,6-7H2,1H3
24 atoms
I  2.851702 0.381308 -0.016845
O  -2.162243 2.051945 -0.626437
O  -2.149619 0.910502 1.316086
N  -3.546314 0.34489 -0.395647
C  -3.511542 -2.122687 -0.584451
C  -1.996849 -2.296477 -0.527615
C  -4.05588 -0.897773 0.144539
C  -1.451635 -2.60764 0.859286
C  -2.586649 1.069411 0.194545
C  -1.08519 2.84671 -0.149042
C  0.158549 2.090414 -0.085667
C  1.185549 1.462679 -0.068355
H  -3.830426 -2.07321 -1.630254
H  -4.000795 -3.00606 -0.162373
H  -1.50428 -1.404266 -0.92621
H  -1.721755 -3.108937 -1.205355
H  -3.824696 -0.934026 1.207755
H  -5.144739 -0.887527 0.065679
H  -0.368165 -2.734839 0.831545
H  -1.6612 -1.814289 1.577061
H  -1.879194 -3.531407 1.254904
H  -3.765259 0.552093 -1.359042
H  -0.987422 3.662972 -0.865241
H  -1.312617 3.289129 0.823588
elementType: I O N C H
totalener: -815.08307301 hartree
nucrepener: 840.55290970 hartree
electener: -1655.63598271 hartree
oneelecener: -2891.13709585 hartree
twoeener: 1235.50111314 hartree
cpcmener: -0.02410141 hartree
kineticenergy: 628.60127190 hartree
xcener: -65.066814279596 hartree
chargesum: -0.0000000
charge: 0.291878 -0.318328 -0.518602 -0.226367 -0.111582 -0.110853 -0.050448 -0.267246 0.502139 0.006863 -0.351684 -0.016291 0.077018 0.065692 0.056839 0.076204 0.099398 0.106282 0.089845 0.075950 0.080001 0.170828 0.132701 0.139761
qa: 0.2919 -0.3183 -0.5186 -0.2264 -0.1116 -0.1109 -0.0504 -0.2672 0.5021 0.0069 -0.3517 -0.0163 0.0770 0.0657 0.0568 0.0762 0.0994 0.1063 0.0898 0.0759 0.0800 0.1708 0.1327 0.1398
va: 1.2204 2.0703 1.9811 3.1847 3.8832 3.8819 3.8696 3.9211 4.3087 3.9266 4.0247 3.8447 1.0119 1.0171 1.0143 1.0075 1.0129 1.0031 1.0051 1.0134 1.0028 1.0166 0.9885 0.9983
dispcorr: -0.009869813 hartree
energy: -815.092942823574
dipole: -223.63332 223.10199 -0.53133 -20.76644 20.49175 -0.27469 0.94455 -2.25014 -1.30560
magnitude: 1.43609 au
magnitude: 3.65025 debye
