program: Orca
programVersion: 5.0.2
elementType: I O O N C C C C C C C C H H H H H H H H H H H H
elementType: I
charge: 0
multiplicity: 1
keywords: wb97x-d3
keywords: def2-TZVPP
keywords: def2/J RIJCOSX
keywords: DEFGRID2
keywords: scfconv7
keywords: smallprint printgap noloewdin
keywords: NOSOSCF
formula: C8H12INO2
InChI: InChI=1/C8H12INO2/c1-2-3-6-10-8(11)12-7-4-5-9/h10H,2-3,6-7H2,1H3
24 atoms
I  3.319349 1.80554 -0.522988
O  -1.504044 -0.254508 0.052112
O  -3.313474 -0.357805 1.394115
N  -3.112878 -1.692241 -0.438925
C  -4.061714 -3.631315 0.790939
C  -5.321272 -4.438184 1.092303
C  -4.294806 -2.486587 -0.189569
C  -5.88611 -5.188534 -0.107706
C  -2.703594 -0.741592 0.426865
C  -0.979208 0.774755 0.875351
C  0.36479 1.080378 0.413567
C  1.480272 1.360216 0.066638
H  -3.67214 -3.211994 1.721228
H  -3.285539 -4.296156 0.397478
H  -6.086866 -3.775115 1.506061
H  -5.090656 -5.155279 1.883537
H  -5.080644 -1.830102 0.187049
H  -4.639297 -2.864318 -1.153459
H  -5.132705 -5.83799 -0.557612
H  -6.727613 -5.817477 0.182774
H  -6.246515 -4.515135 -0.886301
H  -2.46944 -1.991317 -1.151181
H  -1.603767 1.671763 0.824653
H  -0.949697 0.465673 1.924055
totalener: -815.06867699 hartree
nucrepener: 767.80627556 hartree
electener: -1582.87495255 hartree
oneelecener: -2744.77350041 hartree
twoeener: 1161.89854786 hartree
kineticenergy: 628.63321387 hartree
xcener: -65.067067983652 hartree
chargesum: 0.0000000
charge: 0.254391 -0.295181 -0.420411 -0.248587 -0.109579 -0.112652 -0.028189 -0.257686 0.462984 -0.041867 -0.341799 0.077015 0.088723 0.054407 0.061911 0.068769 0.092647 0.087713 0.075818 0.088432 0.071981 0.142869 0.113058 0.115234
qa: 0.2544 -0.2952 -0.4204 -0.2486 -0.1096 -0.1127 -0.0282 -0.2577 0.4630 -0.0419 -0.3418 0.0770 0.0887 0.0544 0.0619 0.0688 0.0926 0.0877 0.0758 0.0884 0.0720 0.1429 0.1131 0.1152
va: 1.2158 2.0784 2.0952 3.1857 3.8500 3.9064 3.8797 3.9324 4.3364 3.9495 4.2152 3.7154 1.0251 1.0168 1.0091 1.0072 1.0147 1.0041 1.0015 1.0072 1.0012 1.0372 0.9896 0.9942
dispcorr: -0.007713493 hartree
energy: -815.076390487212
dipole: -290.46213 290.61023 0.14811 -166.13837 165.49722 -0.64116 41.66639 -42.26894 -0.60255
magnitude: 0.89223 au
magnitude: 2.26788 debye
