program: Orca
programVersion: 5.0.2
elementType: I O O N C C C C C C C C H H H H H H H H H H H H
elementType: I
charge: 0
multiplicity: 1
keywords: wb97x-d3
keywords: def2-TZVPP
keywords: def2/J RIJCOSX
keywords: DEFGRID2
keywords: scfconv7
keywords: smallprint printgap noloewdin
keywords: NOSOSCF
formula: C8H12INO2
InChI: InChI=1/C8H12INO2/c1-2-3-6-10-8(11)12-7-4-5-9/h10H,2-3,6-7H2,1H3
24 atoms
I  2.907345 0.482342 -0.217533
O  -2.208631 1.576735 0.917208
O  -2.471016 0.809175 -1.190071
N  -3.644416 -0.067589 0.550769
C  -3.448801 -2.379211 -0.361961
C  -3.095885 -3.05485 0.956696
C  -4.291469 -1.119044 -0.202026
C  -2.287797 -4.329863 0.762916
C  -2.748301 0.763954 -0.019451
C  -1.224996 2.483117 0.452969
C  0.066885 1.844351 0.239851
C  1.144345 1.336992 0.07997
H  -2.537608 -2.131876 -0.913007
H  -4.006331 -3.079443 -0.992096
H  -4.014636 -3.28505 1.50668
H  -2.526992 -2.363618 1.58495
H  -5.227128 -1.356998 0.308935
H  -4.561065 -0.724955 -1.181629
H  -2.8369 -5.060951 0.16746
H  -1.348985 -4.125513 0.246356
H  -2.043713 -4.79813 1.716476
H  -3.727133 -0.061886 1.552388
H  -1.544951 2.980254 -0.465721
H  -1.135942 3.240679 1.232563
totalener: -815.06924089 hartree
nucrepener: 809.88031449 hartree
electener: -1624.94955539 hartree
oneelecener: -2829.15503649 hartree
twoeener: 1204.20548110 hartree
kineticenergy: 628.64267411 hartree
xcener: -65.068481406305 hartree
chargesum: -0.0000000
charge: 0.251978 -0.306670 -0.411802 -0.247267 -0.094607 -0.102386 -0.062275 -0.254892 0.472316 -0.034192 -0.293414 0.005522 0.079850 0.062899 0.053264 0.055555 0.093097 0.104519 0.072452 0.078950 0.084042 0.146011 0.132826 0.114222
qa: 0.2520 -0.3067 -0.4118 -0.2473 -0.0946 -0.1024 -0.0623 -0.2549 0.4723 -0.0342 -0.2934 0.0055 0.0799 0.0629 0.0533 0.0556 0.0931 0.1045 0.0725 0.0789 0.0840 0.1460 0.1328 0.1142
va: 1.2134 2.0785 2.1008 3.1606 3.7931 3.8749 3.9207 3.9651 4.3270 3.9990 4.0493 3.8546 1.0202 1.0170 1.0053 1.0170 1.0006 1.0187 1.0036 1.0036 1.0052 1.0340 0.9998 0.9860
dispcorr: -0.008295587 hartree
energy: -815.077536480742
dipole: -240.75465 240.34495 -0.40970 -49.21298 48.91424 -0.29874 21.00705 -20.18240 0.82466
magnitude: 0.96807 au
magnitude: 2.46064 debye
