program: Orca
programVersion: 5.0.2
elementType: I O O N C C C C C C C C H H H H H H H H H H H H
elementType: I
charge: 0
multiplicity: 1
keywords: wb97x-d3
keywords: def2-TZVPP
keywords: def2/J RIJCOSX
keywords: DEFGRID2
keywords: scfconv7
keywords: smallprint printgap noloewdin
keywords: NOSOSCF
formula: C8H12INO2
InChI: InChI=1/C8H12INO2/c1-2-3-6-10-8(11)12-7-4-5-9/h10H,2-3,6-7H2,1H3
24 atoms
I  2.787258 1.800427 1.111177
O  -1.635972 -0.108446 -1.204464
O  -2.505902 -0.179319 0.879854
N  -2.348411 -2.045612 -0.413284
C  -4.488808 -3.104761 0.293081
C  -4.857173 -3.686065 -1.066078
C  -2.987865 -2.954717 0.509837
C  -6.356155 -3.887284 -1.233978
C  -2.196515 -0.733292 -0.143226
C  -1.298206 1.253543 -1.019966
C  -0.018167 1.415603 -0.342742
C  1.046111 1.565768 0.194624
H  -4.968679 -2.131471 0.429237
H  -4.881412 -3.752678 1.083257
H  -4.344665 -4.644243 -1.202801
H  -4.492607 -3.027995 -1.859996
H  -2.499237 -3.927397 0.412157
H  -2.790146 -2.605136 1.522425
H  -6.894985 -2.94383 -1.134849
H  -6.597137 -4.302673 -2.212542
H  -6.750985 -4.570225 -0.480225
H  -2.063641 -2.382041 -1.31627
H  -1.23904 1.681352 -2.021705
H  -2.077272 1.786432 -0.470082
totalener: -815.06936701 hartree
nucrepener: 787.91353823 hartree
electener: -1602.98290524 hartree
oneelecener: -2785.16725328 hartree
twoeener: 1182.18434804 hartree
kineticenergy: 628.64123786 hartree
xcener: -65.068458220262 hartree
chargesum: 0.0000000
charge: 0.252208 -0.307608 -0.415343 -0.241490 -0.088868 -0.102779 -0.066879 -0.253982 0.472297 -0.036509 -0.297353 0.013599 0.073402 0.061792 0.054793 0.053491 0.095223 0.106682 0.076694 0.084994 0.073728 0.146040 0.113792 0.132076
qa: 0.2522 -0.3076 -0.4153 -0.2415 -0.0889 -0.1028 -0.0669 -0.2540 0.4723 -0.0365 -0.2974 0.0136 0.0734 0.0618 0.0548 0.0535 0.0952 0.1067 0.0767 0.0850 0.0737 0.1460 0.1138 0.1321
va: 1.2120 2.0784 2.0985 3.1561 3.8092 3.8727 3.9110 3.9650 4.3276 4.0028 4.0702 3.8277 1.0182 1.0175 1.0054 1.0170 1.0000 1.0228 1.0036 1.0050 1.0039 1.0342 0.9853 1.0033
dispcorr: -0.007937715 hartree
energy: -815.077304726042
dipole: -259.62571 259.55533 -0.07037 -150.29700 149.59763 -0.69938 -68.03412 67.30453 -0.72959
magnitude: 1.01310 au
magnitude: 2.57511 debye
