program: Orca
programVersion: 5.0.2
elementType: Cl Cl Cl S O N N C C C C C H H H H H
charge: 0
multiplicity: 1
keywords: wb97x-d3
keywords: def2-TZVPP
keywords: def2/J RIJCOSX
keywords: DEFGRID2
keywords: scfconv7
keywords: smallprint printgap noloewdin
keywords: NOSOSCF
formula: C5H5Cl3N2OS
InChI: InChI=1/C5H5Cl3N2OS/c1-2-11-4-9-3(10-12-4)5(6,7)8/h2H2,1H3
17 atoms
Cl 2.740035 1.02553 -0.993243
Cl 2.088431 0.428308 1.744115
Cl 2.165409 -1.684909 -0.221211
S  -1.768663 0.986086 -1.141668
O  -2.849717 -0.722511 0.665553
N  -0.587401 -0.505159 0.522336
N  -0.117226 1.035456 -1.123391
C  0.286766 0.210428 -0.214829
C  -4.13836 -0.305995 0.165844
C  -1.785574 -0.195826 0.136852
C  1.757138 0.016762 0.053387
C  -5.204458 -1.039443 0.931283
H  -4.239148 0.775078 0.301544
H  -4.197092 -0.539704 -0.901338
H  -5.125173 -2.118113 0.800104
H  -5.169567 -0.806052 1.994971
H  -6.177619 -0.727361 0.552429
elementType: Cl S O N C H
totalener: -2157.13212796 hartree
nucrepener: 1150.00976422 hartree
electener: -3307.14189218 hartree
oneelecener: -5260.03477886 hartree
twoeener: 1952.89288668 hartree
cpcmener: -0.01424235 hartree
kineticenergy: 2153.02459404 hartree
xcener: -117.779077949215 hartree
chargesum: -0.0000000
charge: -0.020933 -0.042442 -0.042595 0.168390 -0.247752 -0.343595 -0.286164 0.129231 0.024031 0.282484 0.120535 -0.257468 0.117206 0.118578 0.093792 0.093837 0.092864
qa: -0.0209 -0.0424 -0.0426 0.1684 -0.2478 -0.3436 -0.2862 0.1292 0.0240 0.2825 0.1205 -0.2575 0.1172 0.1186 0.0938 0.0938 0.0929
va: 1.2682 1.2381 1.2379 2.7094 2.1484 3.0586 2.9683 4.1969 3.7959 4.2184 4.5799 3.9903 0.9872 0.9868 1.0035 1.0035 1.0041
dispcorr: -0.005944932 hartree
energy: -2157.138072893045
dipole: -32.75490 29.97802 -2.77688 -2.93129 3.08265 0.15136 1.90635 -2.18251 -0.27616
magnitude: 2.79468 au
magnitude: 7.10352 debye
