program: Orca
programVersion: 5.0.2
elementType: Cl Cl Cl S O N N C C C C C H H H H H
charge: 0
multiplicity: 1
keywords: wb97x-d3
keywords: def2-TZVPP
keywords: def2/J RIJCOSX
keywords: DEFGRID2
keywords: scfconv7
keywords: smallprint printgap noloewdin
keywords: NOSOSCF
formula: C5H5Cl3N2OS
InChI: InChI=1/C5H5Cl3N2OS/c1-2-11-4-9-3(10-12-4)5(6,7)8/h2H2,1H3
17 atoms
Cl 1.840923 -1.70817 0.599734
Cl 1.797204 -0.177298 -1.845798
Cl 2.874128 0.977659 0.55961
S  -1.561738 1.706094 1.098866
O  -3.106017 -0.119733 -0.012793
N  -0.796618 -0.328058 -0.190657
N  0.071579 1.486202 0.931462
C  0.251082 0.405506 0.249762
C  -3.307846 -1.336401 -0.775793
C  -1.883644 0.259076 0.198663
C  1.635776 -0.085949 -0.083416
C  -4.789195 -1.559913 -0.895087
H  -2.840512 -1.216782 -1.754542
H  -2.817362 -2.160568 -0.255533
H  -5.281676 -0.743602 -1.423368
H  -4.955923 -2.473583 -1.466086
H  -5.2607 -1.68651 0.079372
elementType: Cl S O N C H
totalener: -2157.13381616 hartree
nucrepener: 1154.95258339 hartree
electener: -3312.08639956 hartree
oneelecener: -5269.92010264 hartree
twoeener: 1957.83370308 hartree
cpcmener: -0.00963010 hartree
kineticenergy: 2153.03895392 hartree
xcener: -117.780859376682 hartree
chargesum: 0.0000000
charge: -0.043736 -0.043733 -0.019782 0.176589 -0.266357 -0.362094 -0.274752 0.111360 0.050564 0.309644 0.120827 -0.244723 0.107104 0.107107 0.090241 0.091266 0.090476
qa: -0.0437 -0.0437 -0.0198 0.1766 -0.2664 -0.3621 -0.2748 0.1114 0.0506 0.3096 0.1208 -0.2447 0.1071 0.1071 0.0902 0.0913 0.0905
va: 1.2366 1.2367 1.2698 2.6724 2.1654 3.0286 2.9708 4.2140 3.7967 4.1700 4.5708 3.9650 0.9963 0.9964 1.0039 1.0057 1.0041
dispcorr: -0.006202853 hartree
energy: -2157.140019014795
dipole: -28.60020 26.66695 -1.93325 -6.59709 5.92272 -0.67437 -3.63011 3.23936 -0.39074
magnitude: 2.08445 au
magnitude: 5.29825 debye
