program: Orca
programVersion: 5.0.2
elementType: Cl Cl Cl S O N N C C C C C H H H H H
charge: 0
multiplicity: 1
keywords: wb97x-d3
keywords: def2-TZVPP
keywords: def2/J RIJCOSX
keywords: DEFGRID2
keywords: scfconv7
keywords: smallprint printgap noloewdin
keywords: NOSOSCF
formula: C5H5Cl3N2OS
InChI: InChI=1/C5H5Cl3N2OS/c1-2-11-4-9-3(10-12-4)5(6,7)8/h2H2,1H3
17 atoms
Cl 1.790268 -0.919171 -1.616635
Cl 2.840326 0.98283 0.272501
Cl 1.575146 -1.424558 1.215534
S  -1.531248 2.136874 0.170039
O  -3.180166 0.134981 -0.295209
N  -0.888871 -0.275308 -0.219827
N  0.085331 1.768042 0.207211
C  0.198166 0.500903 -0.010779
C  -3.481904 -1.267519 -0.50643
C  -1.937946 0.480999 -0.14975
C  1.54821 -0.165302 -0.031246
C  -3.401609 -2.061269 0.773406
H  -4.495867 -1.258383 -0.900008
H  -2.818571 -1.665005 -1.275595
H  -2.387601 -2.113424 1.168263
H  -4.058784 -1.650256 1.539816
H  -3.728638 -3.081374 0.567959
elementType: Cl S O N C H
totalener: -2157.13238692 hartree
nucrepener: 1169.15762015 hartree
electener: -3326.29000707 hartree
oneelecener: -5298.34766570 hartree
twoeener: 1972.05765863 hartree
cpcmener: -0.00911911 hartree
kineticenergy: 2153.03539154 hartree
xcener: -117.781305151589 hartree
chargesum: -0.0000000
charge: -0.043476 -0.020148 -0.043824 0.174568 -0.275429 -0.366848 -0.276270 0.112314 0.056087 0.319685 0.120449 -0.254090 0.117813 0.100523 0.089152 0.091585 0.097909
qa: -0.0435 -0.0201 -0.0438 0.1746 -0.2754 -0.3668 -0.2763 0.1123 0.0561 0.3197 0.1204 -0.2541 0.1178 0.1005 0.0892 0.0916 0.0979
va: 1.2372 1.2692 1.2366 2.6728 2.1649 3.0165 2.9706 4.2045 3.8072 4.1537 4.5737 3.9238 0.9931 1.0077 1.0144 1.0044 1.0068
dispcorr: -0.006812221 hartree
energy: -2157.139199145726
dipole: -24.76122 22.85782 -1.90340 -7.39839 6.69049 -0.70790 1.20098 -1.33289 -0.13191
magnitude: 2.03506 au
magnitude: 5.17271 debye
