program: Gaussian 09
title: 000065876
version: EM64L-G09RevD.01
frameworkgroup: C1[X(C15H19NO4S2)]
method: RPBEPBE
basis: SDD
operation: Freq
keyword: #p
keyword: freq=noraman
keyword: PBEPBE/SDD
title: #p freq=noraman PBEPBE/SDD
converged: YES YES NO NO
title: Mulliken charges:
elementType: S S O O O O N C C C C C C C C C C C C C C C H H H H H H H H H H H H H H H H H H H
charge: 0.190044 0.193812 -0.277406 -0.280484 -0.298321 -0.188824 -0.110777 -0.518106 -0.277844 -0.732685 -0.205258 0.276202 -0.796933 0.314279 0.152367 -0.336401 -0.325101 -0.244635 -0.231346 -0.018272 -0.702384 -0.536776 0.318218 0.245951 0.265325 0.332821 0.265382 0.224646 0.259517 0.310367 0.316458 0.248857 0.249411 0.226547 0.228681 0.256676 0.257975 0.248780 0.225002 0.218491 0.255744
chargesum: 0.00000
title: Mulliken charges with hydrogens summed into heavy atoms:
elementType: S S O O O O N C C C C C C C C C C C C C C C
charge: 0.190044 0.193812 -0.277406 -0.280484 -0.298321 -0.188824 -0.110777 -0.199887 0.233431 -0.134482 0.278906 0.276202 -0.170108 0.314279 0.152367 -0.087544 -0.075690 -0.018088 -0.002665 -0.018272 0.061047 0.162460
polarizability: 1.95372089e+02 1.87415881e+01 2.11395652e+02 -1.26659380e+01 8.12775801e-01 2.24961300e+02
1716.lowfreq: -8.1924 -5.7559 -0.0023 -0.0018 -0.0013 0.6988 11.6582 14.3374 25.9922
frequency: 11.0258 14.1652 25.8365 32.7318 47.2541 52.5156 61.1645 73.9051 93.4563 101.0247 110.0011 133.4122 145.6211 158.2907 178.3005 192.8410 202.2146 225.0051 233.8688 240.8948 296.1102 313.7174 336.4400 347.2452 383.4969 438.3434 456.7141 467.6973 479.5350 493.0282 507.1063 509.9300 535.4084 562.1126 577.5246 579.0360 612.8259 629.9081 650.8751 712.2278 725.8584 732.6059 747.6100 755.0269 766.1253 836.9420 845.4525 859.3081 909.8659 926.4492 943.2983 954.2360 968.0936 970.2804 980.1510 1003.5816 1009.5222 1013.8284 1036.9113 1043.4398 1061.1139 1096.5288 1107.4529 1110.8935 1136.6422 1150.6125 1152.9452 1165.3551 1166.5640 1181.1843 1201.7878 1220.5290 1236.5936 1242.2442 1253.2215 1267.4528 1292.2994 1327.2104 1346.2531 1361.1374 1376.9834 1379.4368 1380.7542 1421.9479 1440.5259 1441.1890 1442.2249 1445.5533 1453.7244 1460.7176 1463.9351 1466.2332 1484.8402 1485.6517 1569.6439 1587.3964 1600.8291 1631.3852 2964.6688 2974.1209 2992.9466 2995.9568 3015.0728 3042.2748 3052.8603 3060.0478 3060.5755 3071.1957 3088.8546 3113.4741 3119.9580 3131.9511 3134.5020 3147.4517 3148.4614 3161.0955 3173.1181
redmass: 2.4733 3.4582 3.1051 2.4692 4.9796 4.5134 6.7096 6.2040 4.4615 3.6036 3.6851 3.4628 6.8187 4.7363 4.5011 1.3394 2.2636 3.7907 4.7180 3.8831 5.0234 3.3311 3.7681 3.8226 4.5733 5.3291 11.2623 4.2474 3.8194 4.2452 3.6154 5.4555 5.4715 5.0595 4.0906 4.1632 8.7870 5.0934 4.1549 4.7526 3.0929 3.7286 4.2400 1.4829 4.7676 6.0571 1.4782 1.6165 1.9474 1.4193 5.2273 4.5160 1.3242 2.5103 2.8357 2.2593 1.5379 1.5053 1.9903 1.8564 3.2269 2.3350 2.3222 1.2466 1.8837 1.3258 1.1891 1.2178 1.2561 2.0100 1.2053 1.8240 2.6207 1.6067 1.2244 1.5130 1.1937 1.3826 1.3824 1.5218 3.5376 1.2608 4.2143 1.4028 1.3100 1.1395 1.3161 1.0534 1.0669 1.0641 1.0959 1.2259 1.1336 1.8033 8.4747 6.9744 6.5438 9.7810 1.0313 1.0559 1.0627 1.0362 1.0634 1.1055 1.0857 1.0627 1.1038 1.0944 1.0966 1.1023 1.1017 1.1012 1.0851 1.1100 1.0898 1.0941 1.1004
irintensity: 0.3503 0.1536 1.3300 0.2392 0.0362 15.1768 1.7341 1.1131 1.1497 9.8355 2.2847 1.4524 4.4944 0.4897 3.1427 1.1868 2.5417 6.5516 1.4906 0.6878 11.6516 3.7593 4.8600 1.8404 4.1415 9.4873 2.3350 1.0226 9.6770 2.9606 0.5644 1.5525 14.9359 1.9656 41.7457 22.7845 7.2697 12.3209 13.9140 13.6748 2.1024 6.2214 10.9128 78.1027 14.6762 31.1601 0.1069 12.7935 2.1228 2.8667 41.0866 24.5921 0.5044 43.6478 17.7494 2.6350 4.5555 5.3655 21.7936 7.3275 3.2095 62.3417 164.7986 3.5600 10.0632 0.3027 24.4912 12.1270 14.0341 48.4321 4.4241 37.3620 134.3211 90.3969 2.7053 14.1300 8.8978 8.6428 20.7097 10.2207 153.4746 71.8215 13.9094 5.3825 7.8282 60.8021 13.4449 21.1239 22.0766 13.5556 21.0233 76.4117 2.5373 96.1767 252.4209 3.1489 26.0988 162.0508 67.7572 26.0581 27.2465 1.0180 11.0345 13.0378 7.4831 13.7796 31.8026 8.9526 4.4489 25.3670 6.0817 2.5385 1.0225 1.6044 16.7872 19.7086 12.0231
temp: 298.150 k
press: 1.00000 atm
elementType: 16 16 8 8 8 8 7 6 6 6 6 6 6 6 6 6 6 6 6 6 6 6 1 1 1 1 1 1 1 1 1 1 1 1 1 1 1 1 1 1 1
symmnumber: 1
zpe: 833264.7 jmol-1
zpe.correction: 0.317374 hartree
zpe.thermalcorrener: 0.340924 hartree
zpe.thermalcorrenthalpy: 0.341869 hartree
zpe.thermalcorrgfe: 0.259552 hartree
zpe.sumelectzpe: -1733.081353 hartree
zpe.sumelectthermal: -1733.057802 hartree
zpe.sumelectthermalent: -1733.056858 hartree
zpe.sumelectthermalfe: -1733.139175 hartree
dipole: -0.3201 -1.2475 -1.8371
dipole: 2.2436
quadrupole: -138.4962 -138.7830 -146.1183
quadrupole: -5.8329 -5.7734 -0.5134
quadrupole: 2.6363 2.3495 -4.9858 -5.8329 -5.7734 -0.5134
hfenergy: -1733.3987269 hartree
pointgroup: C01 [X(C15H19N1O4S2)]
dipole: -0.1277663 -0.6545351 0.5782961 debye
polarizability: 199.5232185|-10.808189|217.4433932|-22.6216202|-3.1204539|214.7624284 unknown
InChI: InChI=1S/C15H19NO4S2/c1-11(17)22-10-14(18)16-7-8-21-15(16)9-20-13-6-4-3-5-12(13)19-2/h3-6,15H,7-10H2,1-2H3
charge 0 multiplicity 1
41 atoms
S  0.215951 3.021974 1.654571
S  -2.964799 -0.858497 -1.753443
O  1.415539 0.447763 0.415675
O  -1.077164 2.095067 -2.582812
O  1.72667 -1.491421 2.374372
O  -4.730882 -0.421454 0.314072
N  -1.186885 1.788207 -0.28423
C  0.138218 2.445504 -0.145475
C  -1.898796 1.432602 0.972908
C  -0.892062 1.555668 2.126878
C  1.293804 1.528874 -0.566468
C  -1.715574 1.679861 -1.559491
C  -3.091326 1.036233 -1.707836
C  2.290246 -0.611281 0.125994
C  2.425896 -1.597678 1.149931
C  3.001879 -0.759356 -1.08783
C  3.225505 -2.73447 0.922632
C  3.808921 -1.902129 -1.297865
C  3.913607 -2.897622 -0.303138
C  -4.153361 -1.287583 -0.380267
C  -4.341417 -2.783194 -0.230902
C  2.18933 -0.392528 3.253297
H  0.169045 3.340642 -0.790562
H  -2.752579 2.119647 1.128067
H  -2.287355 0.401626 0.917308
H  -0.261592 0.660439 2.210647
H  -1.385908 1.790673 3.081572
H  2.239918 2.10514 -0.608843
H  1.064042 1.128437 -1.572668
H  -3.796342 1.262488 -0.887346
H  -3.506701 1.348605 -2.675777
H  2.925556 -0.004536 -1.876008
H  3.293934 -3.480059 1.721524
H  4.34937 -2.009269 -2.244511
H  4.530743 -3.786286 -0.470592
H  -4.284432 -3.055448 0.837211
H  -5.351966 -3.053895 -0.589359
H  -3.596549 -3.359573 -0.801739
H  1.550858 -0.44661 4.148908
H  3.247228 -0.551406 3.539293
H  2.075527 0.589543 2.759303
