program: Orca
programVersion: 5.0.2
elementType: S S P O O C C C C C C C C C C C C C C H H H H H H H H H H H H H H H
charge: 0
multiplicity: 1
keywords: wb97x-d3
keywords: def2-TZVPP
keywords: def2/J RIJCOSX
keywords: DEFGRID2
keywords: scfconv7
keywords: smallprint printgap noloewdin
keywords: NOSOSCF
formula: C14H15O2PS2
InChI: InChI=1/C14H15O2PS2/c1-2-16-17(15,18-13-9-5-3-6-10-13)19-14-11-7-4-8-12-14/h3-12H,2H2,1H3
34 atoms
S  -1.371828 2.239017 -0.112091
S  -0.470083 -0.71875 -1.314754
P  -1.411219 0.199638 0.323366
O  -2.97706 -0.020662 0.126786
O  -0.836028 -0.21448 1.627692
C  0.395496 2.432225 -0.021381
C  0.705064 -1.772864 -0.499937
C  -3.670598 -1.092034 0.813969
C  1.14373 2.456471 -1.193091
C  1.846393 -1.233341 0.083798
C  1.010758 2.569642 1.217714
C  0.506687 -3.148469 -0.53154
C  -3.231631 -2.464218 0.365795
C  2.520171 2.615522 -1.119808
C  2.787695 -2.081729 0.646196
C  2.3881 2.723012 1.280796
C  1.462056 -3.989801 0.022479
C  3.142218 2.743309 0.114795
C  2.599274 -3.457972 0.613062
H  -3.540585 -0.968071 1.889551
H  -4.719894 -0.92569 0.581997
H  0.657588 2.347993 -2.153091
H  2.00247 -0.161786 0.095437
H  0.420994 2.562738 2.124454
H  -0.383532 -3.560278 -0.988473
H  -2.19752 -2.679523 0.637754
H  -3.856471 -3.205605 0.86481
H  -3.347482 -2.596047 -0.70928
H  3.105579 2.633812 -2.029386
H  3.675047 -1.666511 1.105031
H  2.871001 2.828641 2.243066
H  1.312617 -5.060886 -0.007153
H  4.216274 2.8626 0.168503
H  3.342101 -4.115206 1.045215
elementType: S P O C H
totalener: -1830.89405237 hartree
nucrepener: 1909.54766339 hartree
electener: -3740.44171576 hartree
oneelecener: -6314.93902399 hartree
twoeener: 2574.49730823 hartree
cpcmener: -0.02955476 hartree
kineticenergy: 1825.74707283 hartree
xcener: -123.397488035434 hartree
chargesum: 0.0000000
charge: -0.136442 -0.144944 0.725645 -0.364216 -0.625245 0.079990 0.000857 0.043502 -0.134528 -0.010420 -0.140902 -0.062492 -0.262906 -0.158790 -0.244501 -0.163608 -0.217058 -0.118716 -0.084378 0.104375 0.110003 0.140245 0.112973 0.143488 0.152175 0.082978 0.105404 0.095377 0.162269 0.157227 0.162855 0.161801 0.163265 0.164718
qa: -0.1364 -0.1449 0.7256 -0.3642 -0.6252 0.0800 0.0009 0.0435 -0.1345 -0.0104 -0.1409 -0.0625 -0.2629 -0.1588 -0.2445 -0.1636 -0.2171 -0.1187 -0.0844 0.1044 0.1100 0.1402 0.1130 0.1435 0.1522 0.0830 0.1054 0.0954 0.1623 0.1572 0.1629 0.1618 0.1633 0.1647
va: 2.3224 2.3092 5.3554 2.1046 1.9454 3.6481 3.7494 3.8510 3.9084 3.7447 3.9218 3.8112 3.9038 3.9027 3.9995 3.9120 3.9716 3.8602 3.8275 1.0021 0.9904 1.0102 0.9894 1.0084 0.9935 1.0069 1.0113 1.0053 0.9888 0.9927 0.9888 0.9898 0.9877 0.9860
dispcorr: -0.018944181 hartree
energy: -1830.912996555270
dipole: 4.45907 -3.77145 0.68762 -10.99087 10.17008 -0.82079 3.54993 -4.02810 -0.47817
magnitude: 1.17267 au
magnitude: 2.98070 debye
