program: Orca
programVersion: 5.0.2
elementType: S S P O O C C C C C C C C C C C C C C H H H H H H H H H H H H H H H
charge: 0
multiplicity: 1
keywords: wb97x-d3
keywords: def2-TZVPP
keywords: def2/J RIJCOSX
keywords: DEFGRID2
keywords: scfconv7
keywords: smallprint printgap noloewdin
keywords: NOSOSCF
formula: C14H15O2PS2
InChI: InChI=1/C14H15O2PS2/c1-2-16-17(15,18-13-9-5-3-6-10-13)19-14-11-7-4-8-12-14/h3-12H,2H2,1H3
34 atoms
S  -1.369998 1.852311 -0.135783
S  -0.40821 -1.089134 -1.537057
P  -1.536844 -0.228717 0.0061
O  -3.015843 -0.424515 -0.55116
O  -1.220358 -0.774947 1.349199
C  0.3812 2.012928 0.131451
C  0.992559 -1.683681 -0.615557
C  -4.119436 -0.774186 0.323946
C  1.173172 2.465374 -0.918451
C  0.88868 -2.849695 0.134635
C  0.943162 1.740513 1.374643
C  2.203588 -1.009994 -0.714588
C  -4.62526 0.421128 1.09075
C  2.534905 2.644997 -0.721206
C  2.003509 -3.327323 0.806719
C  2.308851 1.899256 1.553661
C  3.314543 -1.498013 -0.042306
C  3.104823 2.354018 0.510062
C  3.214427 -2.652288 0.721626
H  -4.883767 -1.166487 -0.342254
H  -3.813938 -1.57753 0.994944
H  0.730807 2.676843 -1.882811
H  -0.050352 -3.383503 0.190978
H  0.323559 1.411339 2.197661
H  2.278009 -0.107823 -1.306216
H  -4.941641 1.221537 0.422144
H  -5.488893 0.11934 1.683822
H  -3.876231 0.813969 1.779625
H  3.150106 3.003431 -1.535633
H  1.925865 -4.231913 1.394194
H  2.749786 1.675413 2.515447
H  4.256071 -0.970068 -0.114125
H  4.168014 2.486473 0.658854
H  4.081024 -3.029702 1.247543
elementType: S P O C H
totalener: -1830.89337645 hartree
nucrepener: 1915.41114868 hartree
electener: -3746.30452513 hartree
oneelecener: -6326.78760737 hartree
twoeener: 2580.48308224 hartree
cpcmener: -0.02872551 hartree
kineticenergy: 1825.75053375 hartree
xcener: -123.397841268002 hartree
chargesum: 0.0000000
charge: -0.132323 -0.139232 0.729867 -0.375052 -0.622504 0.066947 0.057417 0.047139 -0.126158 -0.129121 -0.108090 -0.122599 -0.258039 -0.161794 -0.174546 -0.169641 -0.200303 -0.135723 -0.109752 0.108501 0.101385 0.138722 0.143969 0.141824 0.174911 0.093712 0.102855 0.084659 0.160519 0.162710 0.161927 0.161495 0.162037 0.164283
qa: -0.1323 -0.1392 0.7299 -0.3751 -0.6225 0.0669 0.0574 0.0471 -0.1262 -0.1291 -0.1081 -0.1226 -0.2580 -0.1618 -0.1745 -0.1696 -0.2003 -0.1357 -0.1098 0.1085 0.1014 0.1387 0.1440 0.1418 0.1749 0.0937 0.1029 0.0847 0.1605 0.1627 0.1619 0.1615 0.1620 0.1643
va: 2.3233 2.3141 5.3362 2.1071 1.9555 3.6653 3.7265 3.8549 3.8959 3.9068 3.8404 3.8154 3.9031 3.8851 3.9238 3.8761 3.9305 3.8343 3.8673 0.9902 1.0035 1.0120 1.0032 1.0133 0.9862 1.0025 1.0106 1.0155 0.9888 0.9880 0.9894 0.9925 0.9889 0.9862
dispcorr: -0.019315406 hartree
energy: -1830.912691860455
dipole: 1.92394 -1.18190 0.74204 -0.57614 0.72995 0.15381 7.00599 -7.12432 -0.11833
magnitude: 0.76700 au
magnitude: 1.94955 debye
