program: Orca
programVersion: 5.0.2
elementType: S S P O O C C C C C C C C C C C C C C H H H H H H H H H H H H H H H
charge: 0
multiplicity: 1
keywords: wb97x-d3
keywords: def2-TZVPP
keywords: def2/J RIJCOSX
keywords: DEFGRID2
keywords: scfconv7
keywords: smallprint printgap noloewdin
keywords: NOSOSCF
formula: C14H15O2PS2
InChI: InChI=1/C14H15O2PS2/c1-2-16-17(15,18-13-9-5-3-6-10-13)19-14-11-7-4-8-12-14/h3-12H,2H2,1H3
34 atoms
S  -1.391131 1.79426 -0.184549
S  -0.475975 -1.234672 -1.449119
P  -1.538312 -0.276399 0.081765
O  -3.038737 -0.51015 -0.397222
O  -1.159226 -0.743124 1.438275
C  0.368428 1.986872 -0.011807
C  0.984146 -1.716052 -0.551837
C  -4.110332 -0.759495 0.549031
C  1.102762 2.381941 -1.125059
C  2.173016 -1.036144 -0.783696
C  0.99285 1.799034 1.217003
C  0.943372 -2.795561 0.32389
C  -4.58637 0.511288 1.205143
C  2.469666 2.587961 -1.00605
C  3.325149 -1.425391 -0.116021
C  2.363105 1.984422 1.319252
C  2.098934 -3.173589 0.990843
C  3.10177 2.381101 0.211656
C  3.287267 -2.487349 0.776228
H  -4.899681 -1.215036 -0.044055
H  -3.781983 -1.490113 1.288912
H  0.611974 2.527819 -2.078041
H  2.198421 -0.203046 -1.472575
H  0.417891 1.515299 2.08796
H  0.021355 -3.337949 0.484085
H  -4.924671 1.24033 0.468767
H  -5.42911 0.277075 1.856211
H  -3.812925 0.969184 1.823611
H  3.040323 2.900615 -1.870255
H  4.249219 -0.890537 -0.290037
H  2.852901 1.826673 2.270397
H  2.069843 -4.007915 1.678359
H  4.168986 2.533658 0.299999
H  4.185088 -2.785159 1.301001
elementType: S P O C H
totalener: -1830.89337796 hartree
nucrepener: 1918.14427164 hartree
electener: -3749.03764960 hartree
oneelecener: -6332.25602630 hartree
twoeener: 2583.21837670 hartree
cpcmener: -0.02870782 hartree
kineticenergy: 1825.75305035 hartree
xcener: -123.398756657161 hartree
chargesum: 0.0000000
charge: -0.133652 -0.138203 0.731642 -0.375169 -0.622812 0.068500 0.063133 0.046646 -0.124053 -0.123229 -0.109466 -0.134805 -0.257529 -0.163652 -0.199737 -0.169468 -0.172000 -0.134369 -0.111617 0.108932 0.100859 0.138274 0.170872 0.141941 0.144855 0.093804 0.102722 0.084456 0.160369 0.162351 0.161070 0.162434 0.162276 0.164624
qa: -0.1337 -0.1382 0.7316 -0.3752 -0.6228 0.0685 0.0631 0.0466 -0.1241 -0.1232 -0.1095 -0.1348 -0.2575 -0.1637 -0.1997 -0.1695 -0.1720 -0.1344 -0.1116 0.1089 0.1009 0.1383 0.1709 0.1419 0.1449 0.0938 0.1027 0.0845 0.1604 0.1624 0.1611 0.1624 0.1623 0.1646
va: 2.3227 2.3144 5.3368 2.1086 1.9560 3.6613 3.7211 3.8566 3.8910 3.8213 3.8394 3.9036 3.9010 3.8873 3.9267 3.8743 3.9236 3.8290 3.8693 0.9899 1.0039 1.0119 0.9896 1.0124 1.0042 1.0023 1.0109 1.0155 0.9888 0.9918 0.9898 0.9882 0.9886 0.9860
dispcorr: -0.019461735 hartree
energy: -1830.912839697650
dipole: 2.24756 -1.51522 0.73234 0.41820 -0.18348 0.23472 6.85828 -7.01646 -0.15818
magnitude: 0.78513 au
magnitude: 1.99564 debye
