program: Orca
programVersion: 5.0.2
elementType: S S P O O C C C C C C C C C C C C C C H H H H H H H H H H H H H H H
charge: 0
multiplicity: 1
keywords: wb97x-d3
keywords: def2-TZVPP
keywords: def2/J RIJCOSX
keywords: DEFGRID2
keywords: scfconv7
keywords: smallprint printgap noloewdin
keywords: NOSOSCF
formula: C14H15O2PS2
InChI: InChI=1/C14H15O2PS2/c1-2-16-17(15,18-13-9-5-3-6-10-13)19-14-11-7-4-8-12-14/h3-12H,2H2,1H3
34 atoms
S  -1.481587 1.82002 -0.012844
S  0.061222 -0.764678 -1.274056
P  -0.789401 -0.081548 0.510878
O  -2.108588 -0.923105 0.793103
O  0.137673 -0.133964 1.664873
C  0.091905 2.653196 0.031067
C  0.858926 -2.205919 -0.597075
C  -3.17359 -1.13918 -0.160199
C  0.582581 3.113866 1.247641
C  2.164206 -2.105904 -0.13053
C  0.7982 2.859699 -1.147357
C  0.176592 -3.416061 -0.551637
C  -4.385998 -0.314593 0.19121
C  1.798879 3.778822 1.281652
C  2.791036 -3.231199 0.383381
C  2.014044 3.527259 -1.102171
C  0.811389 -4.535274 -0.032276
C  2.515233 3.983012 0.109596
C  2.115942 -4.443755 0.434506
H  -2.829296 -0.92477 -1.174295
H  -3.400708 -2.20295 -0.112261
H  0.019621 2.958611 2.158124
H  2.687091 -1.15968 -0.169932
H  0.406393 2.50268 -2.090422
H  -0.839104 -3.485162 -0.918917
H  -5.193669 -0.572416 -0.493825
H  -4.729674 -0.519351 1.204577
H  -4.204611 0.756129 0.095118
H  2.186028 4.137126 2.22607
H  3.806941 -3.15797 0.747883
H  2.569218 3.688839 -2.016413
H  0.284037 -5.479041 0.006834
H  3.464441 4.501299 0.140485
H  2.607931 -5.318507 0.838688
elementType: S P O C H
totalener: -1830.89484390 hartree
nucrepener: 1872.57381365 hartree
electener: -3703.46865754 hartree
oneelecener: -6241.05680640 hartree
twoeener: 2537.58814886 hartree
cpcmener: -0.03547747 hartree
kineticenergy: 1825.74910854 hartree
xcener: -123.397523826384 hartree
chargesum: -0.0000000
charge: -0.171378 -0.163128 0.707000 -0.348371 -0.627786 0.127235 0.101966 0.025635 -0.160581 -0.148899 -0.145379 -0.117124 -0.232590 -0.153357 -0.160569 -0.159277 -0.176442 -0.130518 -0.125277 0.104731 0.113009 0.146776 0.144131 0.146455 0.152116 0.097647 0.094065 0.079657 0.162561 0.163377 0.163266 0.162665 0.164382 0.164001
qa: -0.1714 -0.1631 0.7070 -0.3484 -0.6278 0.1272 0.1020 0.0256 -0.1606 -0.1489 -0.1454 -0.1171 -0.2326 -0.1534 -0.1606 -0.1593 -0.1764 -0.1305 -0.1253 0.1047 0.1130 0.1468 0.1441 0.1465 0.1521 0.0976 0.0941 0.0797 0.1626 0.1634 0.1633 0.1627 0.1644 0.1640
va: 2.3000 2.2797 5.4158 2.0975 1.9754 3.6683 3.6975 3.8203 3.9633 3.9455 3.9352 3.9125 3.9596 3.9108 3.9150 3.9230 3.9286 3.8834 3.8734 1.0031 0.9939 1.0053 1.0013 1.0041 0.9942 1.0071 1.0033 1.0060 0.9884 0.9877 0.9884 0.9890 0.9871 0.9870
dispcorr: -0.016534491 hartree
energy: -1830.911378388459
dipole: -2.47702 2.08414 -0.39288 -3.66039 3.29312 -0.36726 -0.55444 -0.98410 -1.53854
magnitude: 1.62983 au
magnitude: 4.14270 debye
