program: Orca
programVersion: 5.0.2
elementType: S S P O O C C C C C C C C C C C C C C H H H H H H H H H H H H H H H
charge: 0
multiplicity: 1
keywords: wb97x-d3
keywords: def2-TZVPP
keywords: def2/J RIJCOSX
keywords: DEFGRID2
keywords: scfconv7
keywords: smallprint printgap noloewdin
keywords: NOSOSCF
formula: C14H15O2PS2
InChI: InChI=1/C14H15O2PS2/c1-2-16-17(15,18-13-9-5-3-6-10-13)19-14-11-7-4-8-12-14/h3-12H,2H2,1H3
34 atoms
S  -1.361747 1.685789 0.143004
S  -0.822472 -1.591559 -0.807041
P  -1.584092 -0.326179 0.682937
O  -3.151859 -0.518679 0.51978
O  -1.092611 -0.642208 2.045746
C  0.40971 1.816067 0.051884
C  0.885531 -1.70986 -0.325552
C  -3.879641 -0.298432 -0.715812
C  1.203551 1.632375 1.18002
C  1.253108 -2.40698 0.820513
C  0.975892 2.197627 -1.158495
C  1.849432 -1.164154 -1.164531
C  -4.86669 0.824512 -0.538589
C  2.575806 1.804367 1.080768
C  2.597935 -2.525176 1.140344
C  2.347491 2.394959 -1.23904
C  3.192055 -1.302548 -0.843795
C  3.148251 2.190722 -0.124626
C  3.566827 -1.974567 0.311603
H  -3.192038 -0.080231 -1.536582
H  -4.382547 -1.237036 -0.944108
H  0.760586 1.364531 2.129097
H  0.502548 -2.859774 1.453151
H  0.353685 2.341763 -2.031903
H  1.555303 -0.630567 -2.058096
H  -4.371641 1.775631 -0.338235
H  -5.441211 0.936013 -1.458816
H  -5.567419 0.617525 0.269683
H  3.196785 1.649244 1.953033
H  2.888412 -3.059305 2.035404
H  2.789101 2.698764 -2.178718
H  3.942937 -0.874976 -1.494653
H  4.218625 2.334021 -0.193022
H  4.61454 -2.073782 0.563837
elementType: S P O C H
totalener: -1830.89223147 hartree
nucrepener: 1929.07384885 hartree
electener: -3759.96608032 hartree
oneelecener: -6353.60925164 hartree
twoeener: 2593.64317132 hartree
cpcmener: -0.03189433 hartree
kineticenergy: 1825.73304186 hartree
xcener: -123.397685231585 hartree
chargesum: -0.0000000
charge: -0.144258 -0.153997 0.726989 -0.363240 -0.617899 0.082244 0.058535 0.019726 -0.127716 -0.126201 -0.146618 -0.081275 -0.228398 -0.170813 -0.172623 -0.139415 -0.208218 -0.136376 -0.109745 0.101371 0.121687 0.145108 0.142620 0.141503 0.148817 0.077888 0.096298 0.094934 0.161164 0.162971 0.159990 0.159693 0.162710 0.162543
qa: -0.1443 -0.1540 0.7270 -0.3632 -0.6179 0.0822 0.0585 0.0197 -0.1277 -0.1262 -0.1466 -0.0813 -0.2284 -0.1708 -0.1726 -0.1394 -0.2082 -0.1364 -0.1097 0.1014 0.1217 0.1451 0.1426 0.1415 0.1488 0.0779 0.0963 0.0949 0.1612 0.1630 0.1600 0.1597 0.1627 0.1625
va: 2.3297 2.3082 5.3871 2.0962 1.9804 3.6726 3.7147 3.8244 3.8335 3.9051 3.8753 3.8053 3.9386 3.8618 3.9329 3.8800 3.9186 3.8324 3.8459 0.9995 0.9970 1.0151 1.0126 1.0088 1.0010 1.0094 1.0068 1.0033 0.9906 0.9883 0.9886 0.9928 0.9882 0.9875
dispcorr: -0.020012491 hartree
energy: -1830.912243959483
dipole: 3.24589 -2.23620 1.00969 3.20442 -2.58869 0.61573 -4.93977 2.70697 -2.23280
magnitude: 2.52665 au
magnitude: 6.42224 debye
