program: Orca
programVersion: 5.0.2
elementType: S S P O O C C C C C C C C C C C C C C H H H H H H H H H H H H H H H
charge: 0
multiplicity: 1
keywords: wb97x-d3
keywords: def2-TZVPP
keywords: def2/J RIJCOSX
keywords: DEFGRID2
keywords: scfconv7
keywords: smallprint printgap noloewdin
keywords: NOSOSCF
formula: C14H15O2PS2
InChI: InChI=1/C14H15O2PS2/c1-2-16-17(15,18-13-9-5-3-6-10-13)19-14-11-7-4-8-12-14/h3-12H,2H2,1H3
34 atoms
S  -1.028985 1.185257 -0.956251
S  -0.891599 -2.187509 -0.321458
P  -1.615004 -0.347236 0.348576
O  -3.133875 -0.571095 -0.070507
O  -1.323011 -0.046718 1.772749
C  0.541385 1.677682 -0.279507
C  0.859139 -1.879815 -0.226937
C  -4.233896 -0.012903 0.69252
C  0.628575 2.294821 0.964321
C  1.48487 -1.655142 0.995269
C  1.675594 1.507751 -1.065098
C  1.602115 -1.942527 -1.400292
C  -4.418315 1.460625 0.436774
C  1.867351 2.705313 1.434108
C  2.858004 -1.464981 1.032099
C  2.906802 1.939277 -0.593627
C  2.979326 -1.78088 -1.348073
C  3.006151 2.527804 0.659261
C  3.606871 -1.534102 -0.135628
H  -5.103732 -0.578207 0.365584
H  -4.079987 -0.216945 1.752448
H  -0.257676 2.460586 1.560383
H  0.912158 -1.633354 1.911969
H  1.599545 1.037697 -2.036139
H  1.110765 -2.115008 -2.348681
H  -5.305736 1.797817 0.973076
H  -3.574364 2.050159 0.794699
H  -4.568183 1.66907 -0.622301
H  1.93985 3.174213 2.406407
H  3.34441 -1.276466 1.979807
H  3.788904 1.804696 -1.205303
H  3.55871 -1.835384 -2.260028
H  3.969066 2.853779 1.029359
H  4.679272 -1.396187 -0.098553
elementType: S P O C H
totalener: -1830.89363539 hartree
nucrepener: 1929.80044702 hartree
electener: -3760.69408241 hartree
oneelecener: -6355.44334408 hartree
twoeener: 2594.74926167 hartree
cpcmener: -0.02783754 hartree
kineticenergy: 1825.74572272 hartree
xcener: -123.399230365489 hartree
chargesum: 0.0000000
charge: -0.138146 -0.117357 0.728272 -0.371808 -0.618801 0.052267 0.070500 0.046417 -0.119223 -0.137360 -0.083823 -0.139148 -0.256160 -0.176515 -0.166610 -0.210175 -0.145393 -0.110505 -0.137266 0.109287 0.102685 0.142362 0.142671 0.147459 0.138896 0.102528 0.084930 0.092357 0.162820 0.161727 0.158924 0.159736 0.161573 0.162880
qa: -0.1381 -0.1174 0.7283 -0.3718 -0.6188 0.0523 0.0705 0.0464 -0.1192 -0.1374 -0.0838 -0.1391 -0.2562 -0.1765 -0.1666 -0.2102 -0.1454 -0.1105 -0.1373 0.1093 0.1027 0.1424 0.1427 0.1475 0.1389 0.1025 0.0849 0.0924 0.1628 0.1617 0.1589 0.1597 0.1616 0.1629
va: 2.3141 2.3420 5.3535 2.1144 1.9599 3.6996 3.6670 3.8502 3.8837 3.8474 3.8176 3.8871 3.9084 3.9310 3.8591 3.9215 3.8787 3.8441 3.8299 0.9899 1.0050 1.0085 1.0163 1.0022 1.0106 1.0107 1.0095 1.0026 0.9887 0.9899 0.9929 0.9889 0.9877 0.9883
dispcorr: -0.020322963 hartree
energy: -1830.913958353232
dipole: 3.16603 -2.29897 0.86706 7.59187 -7.01981 0.57205 3.04536 -3.67531 -0.62995
magnitude: 1.21485 au
magnitude: 3.08790 debye
