program: Orca
programVersion: 5.0.2
elementType: S S P O O C C C C C C C C C C C C C C H H H H H H H H H H H H H H H
charge: 0
multiplicity: 1
keywords: wb97x-d3
keywords: def2-TZVPP
keywords: def2/J RIJCOSX
keywords: DEFGRID2
keywords: scfconv7
keywords: smallprint printgap noloewdin
keywords: NOSOSCF
formula: C14H15O2PS2
InChI: InChI=1/C14H15O2PS2/c1-2-16-17(15,18-13-9-5-3-6-10-13)19-14-11-7-4-8-12-14/h3-12H,2H2,1H3
34 atoms
S  -0.716197 0.645676 1.433328
S  -0.289881 -1.152789 -1.443848
P  -1.650803 -0.586995 0.027251
O  -2.594905 0.279128 -0.923831
O  -2.328992 -1.660646 0.799289
C  0.434767 1.637323 0.515209
C  1.066461 -1.701134 -0.433187
C  -4.006154 0.4422 -0.634111
C  1.733599 1.703682 1.009812
C  0.934902 -2.776422 0.439661
C  0.072459 2.367236 -0.61166
C  2.288403 -1.056819 -0.586103
C  -4.26541 1.25626 0.608403
C  2.673471 2.497701 0.369938
C  2.030918 -3.181715 1.187304
C  1.02828 3.13523 -1.261166
C  3.383196 -1.483331 0.151986
C  2.326229 3.205505 -0.772372
C  3.253265 -2.537283 1.045555
H  -4.403548 0.942579 -1.514458
H  -4.471915 -0.541479 -0.566569
H  2.016588 1.127256 1.880989
H  -0.008773 -3.29546 0.538646
H  -0.940324 2.342343 -0.9890
H  2.384244 -0.223474 -1.269827
H  -3.777512 2.229507 0.563104
H  -5.33947 1.423672 0.69161
H  -3.945019 0.744027 1.515611
H  3.682438 2.547114 0.757559
H  1.929794 -4.009761 1.876391
H  0.750533 3.69098 -2.147006
H  4.334314 -0.980973 0.034796
H  3.06406 3.813059 -1.279494
H  4.105689 -2.860999 1.628108
elementType: S P O C H
totalener: -1830.89320061 hartree
nucrepener: 1925.97401543 hartree
electener: -3756.86721604 hartree
oneelecener: -6347.14223908 hartree
twoeener: 2590.27502303 hartree
cpcmener: -0.02899277 hartree
kineticenergy: 1825.73286736 hartree
xcener: -123.399111172892 hartree
chargesum: -0.0000000
charge: -0.126058 -0.110986 0.709419 -0.351117 -0.638502 0.070762 0.026959 0.039961 -0.094878 -0.121028 -0.153137 -0.093014 -0.259127 -0.178410 -0.175319 -0.168528 -0.184279 -0.132359 -0.122450 0.111278 0.106695 0.138902 0.144692 0.151453 0.149829 0.094087 0.104991 0.083771 0.160788 0.163673 0.163669 0.160903 0.163137 0.164222
qa: -0.1261 -0.1110 0.7094 -0.3511 -0.6385 0.0708 0.0270 0.0400 -0.0949 -0.1210 -0.1531 -0.0930 -0.2591 -0.1784 -0.1753 -0.1685 -0.1843 -0.1324 -0.1224 0.1113 0.1067 0.1389 0.1447 0.1515 0.1498 0.0941 0.1050 0.0838 0.1608 0.1637 0.1637 0.1609 0.1631 0.1642
va: 2.3313 2.3438 5.3564 2.0911 1.9600 3.6669 3.7145 3.8276 3.8301 3.9004 3.8704 3.8209 3.9178 3.9211 3.9405 3.9274 3.9247 3.8713 3.8746 0.9921 1.0059 1.0099 1.0149 1.0069 0.9961 1.0023 1.0103 1.0112 0.9899 0.9883 0.9887 0.9920 0.9877 0.9869
dispcorr: -0.019731299 hartree
energy: -1830.912931910363
dipole: 1.15543 0.17577 1.33120 7.35104 -5.72638 1.62466 1.05385 -1.66087 -0.60702
magnitude: 2.18634 au
magnitude: 5.55723 debye
