program: Orca
programVersion: 5.0.2
elementType: S S P O O C C C C C C C C C C C C C C H H H H H H H H H H H H H H H
charge: 0
multiplicity: 1
keywords: wb97x-d3
keywords: def2-TZVPP
keywords: def2/J RIJCOSX
keywords: DEFGRID2
keywords: scfconv7
keywords: smallprint printgap noloewdin
keywords: NOSOSCF
formula: C14H15O2PS2
InChI: InChI=1/C14H15O2PS2/c1-2-16-17(15,18-13-9-5-3-6-10-13)19-14-11-7-4-8-12-14/h3-12H,2H2,1H3
34 atoms
S  -0.592946 1.909361 -1.195391
S  0.317785 -1.079934 -1.877696
P  -0.121909 0.110554 -0.226028
O  -1.487644 -0.519922 0.303975
O  0.944615 0.25603 0.799903
C  0.142576 3.035557 -0.031659
C  0.403939 -2.624842 -0.994931
C  -1.803438 -0.582432 1.717501
C  -0.609954 3.502161 1.039308
C  -0.670496 -3.50567 -1.04058
C  1.452431 3.459994 -0.220229
C  1.550283 -2.93471 -0.270116
C  -1.369399 -1.900407 2.305428
C  -0.040019 4.3969 1.93376
C  -0.59277 -4.708256 -0.352421
C  2.011676 4.358902 0.676481
C  1.61266 -4.134242 0.424264
C  1.269047 4.823986 1.75379
C  0.542744 -5.018993 0.385078
H  -1.352808 0.259032 2.246087
H  -2.884354 -0.464807 1.770577
H  -1.630064 3.168305 1.177046
H  -1.559521 -3.256282 -1.604751
H  2.030516 3.093143 -1.05791
H  2.387536 -2.249529 -0.250065
H  -0.286119 -2.021419 2.274659
H  -1.681719 -1.943499 3.349512
H  -1.831092 -2.739864 1.78569
H  -0.62073 4.75931 2.771452
H  -1.425963 -5.397891 -0.385425
H  3.031055 4.691876 0.533844
H  2.500276 -4.377076 0.99364
H  1.710515 5.522127 2.452652
H  0.595674 -5.954462 0.926334
elementType: S P O C H
totalener: -1830.89347804 hartree
nucrepener: 1867.75563351 hartree
electener: -3698.64911155 hartree
oneelecener: -6231.51468672 hartree
twoeener: 2532.86557518 hartree
cpcmener: -0.03106461 hartree
kineticenergy: 1825.73003681 hartree
xcener: -123.391138550600 hartree
chargesum: 0.0000000
charge: -0.149700 -0.130282 0.700998 -0.345585 -0.633971 0.078518 0.098524 0.058083 -0.128491 -0.142809 -0.135273 -0.143251 -0.265089 -0.167050 -0.173656 -0.164063 -0.175502 -0.124805 -0.109802 0.097828 0.109588 0.149663 0.142362 0.143234 0.145963 0.083414 0.109401 0.090843 0.163530 0.162286 0.163112 0.163088 0.164974 0.163919
qa: -0.1497 -0.1303 0.7010 -0.3456 -0.6340 0.0785 0.0985 0.0581 -0.1285 -0.1428 -0.1353 -0.1433 -0.2651 -0.1671 -0.1737 -0.1641 -0.1755 -0.1248 -0.1098 0.0978 0.1096 0.1497 0.1424 0.1432 0.1460 0.0834 0.1094 0.0908 0.1635 0.1623 0.1631 0.1631 0.1650 0.1639
va: 2.2983 2.3304 5.3734 2.0838 1.9329 3.6818 3.6606 3.8375 3.9245 3.9216 3.9397 3.9207 3.9269 3.9265 3.8933 3.9189 3.9271 3.8698 3.8510 1.0008 0.9938 0.9982 1.0082 1.0039 1.0083 1.0107 1.0126 1.0015 0.9882 0.9885 0.9879 0.9891 0.9869 0.9870
dispcorr: -0.017814973 hartree
energy: -1830.911293010967
dipole: -1.88420 1.01411 -0.87008 -6.47583 5.92405 -0.55178 15.50992 -14.38266 1.12727
magnitude: 1.52717 au
magnitude: 3.88175 debye
