program: Orca
programVersion: 5.0.2
elementType: S S P O O C C C C C C C C C C C C C C H H H H H H H H H H H H H H H
charge: 0
multiplicity: 1
keywords: wb97x-d3
keywords: def2-TZVPP
keywords: def2/J RIJCOSX
keywords: DEFGRID2
keywords: scfconv7
keywords: smallprint printgap noloewdin
keywords: NOSOSCF
formula: C14H15O2PS2
InChI: InChI=1/C14H15O2PS2/c1-2-16-17(15,18-13-9-5-3-6-10-13)19-14-11-7-4-8-12-14/h3-12H,2H2,1H3
34 atoms
S  -0.328331 1.842878 -1.578575
S  -0.291794 -1.347968 -1.954202
P  0.075909 0.100544 -0.49518
O  -1.130605 -0.05824 0.538641
O  1.426529 0.060792 0.12678
C  -0.065813 2.936404 -0.194876
C  0.179723 -2.741704 -0.948734
C  -0.932343 0.011505 1.972454
C  -1.137651 3.292093 0.615702
C  -0.80643 -3.501116 -0.331483
C  1.21139 3.423912 0.056902
C  1.525188 -3.055921 -0.793554
C  -0.615186 -1.342931 2.551407
C  -0.922349 4.138788 1.693036
C  -0.438254 -4.5847 0.452777
C  1.414317 4.274379 1.132931
C  1.882451 -4.135397 -0.000499
C  0.35073 4.628022 1.952309
C  0.902926 -4.897326 0.623488
H  -0.155483 0.738229 2.210512
H  -1.873109 0.394855 2.36409
H  -2.128933 2.910324 0.41193
H  -1.850058 -3.24766 -0.4563
H  2.03825 3.145644 -0.582131
H  2.285684 -2.466548 -1.287517
H  -0.526854 -1.252787 3.634725
H  -1.405879 -2.062198 2.340609
H  0.327681 -1.737082 2.171364
H  -1.75175 4.415624 2.329852
H  -1.201589 -5.179046 0.936692
H  2.406215 4.657192 1.332036
H  2.927986 -4.380282 0.129054
H  0.514288 5.288083 2.793125
H  1.186553 -5.737864 1.241993
elementType: S P O C H
totalener: -1830.89341491 hartree
nucrepener: 1884.72592259 hartree
electener: -3715.61933750 hartree
oneelecener: -6265.24132585 hartree
twoeener: 2549.62198835 hartree
cpcmener: -0.03009551 hartree
kineticenergy: 1825.75033264 hartree
xcener: -123.396182087195 hartree
chargesum: 0.0000000
charge: -0.144377 -0.139578 0.703625 -0.350140 -0.635223 0.088424 0.115908 0.065135 -0.137295 -0.157257 -0.153501 -0.168747 -0.260445 -0.157101 -0.155874 -0.159622 -0.150860 -0.129130 -0.130482 0.097002 0.112704 0.147502 0.145300 0.146826 0.146545 0.109931 0.092027 0.075958 0.163467 0.163589 0.163772 0.163360 0.164448 0.164108
qa: -0.1444 -0.1396 0.7036 -0.3501 -0.6352 0.0884 0.1159 0.0651 -0.1373 -0.1573 -0.1535 -0.1687 -0.2604 -0.1571 -0.1559 -0.1596 -0.1509 -0.1291 -0.1305 0.0970 0.1127 0.1475 0.1453 0.1468 0.1465 0.1099 0.0920 0.0760 0.1635 0.1636 0.1638 0.1634 0.1644 0.1641
va: 2.2875 2.2969 5.4024 2.0655 1.9360 3.6766 3.6522 3.8058 3.9034 3.9123 3.9592 3.9591 3.9563 3.9077 3.8888 3.9171 3.9138 3.8817 3.8784 0.9989 0.9900 1.0053 1.0079 1.0048 1.0087 1.0108 0.9994 1.0096 0.9881 0.9877 0.9878 0.9883 0.9872 0.9874
dispcorr: -0.018752169 hartree
energy: -1830.912167077934
dipole: -0.09033 -0.82227 -0.91260 -4.16094 3.99787 -0.16307 18.60737 -16.79060 1.81677
magnitude: 2.03963 au
magnitude: 5.18433 debye
