program: Orca
programVersion: 5.0.2
elementType: S S P O O C C C C C C C C C C C C C C H H H H H H H H H H H H H H H
charge: 0
multiplicity: 1
keywords: wb97x-d3
keywords: def2-TZVPP
keywords: def2/J RIJCOSX
keywords: DEFGRID2
keywords: scfconv7
keywords: smallprint printgap noloewdin
keywords: NOSOSCF
formula: C14H15O2PS2
InChI: InChI=1/C14H15O2PS2/c1-2-16-17(15,18-13-9-5-3-6-10-13)19-14-11-7-4-8-12-14/h3-12H,2H2,1H3
34 atoms
S  -0.480037 1.082932 -1.061962
S  0.381195 -0.826392 1.621064
P  -1.19213 0.19556 0.702406
O  -2.231287 -0.890624 0.198014
O  -1.742403 1.155997 1.689651
C  0.479819 2.356482 -0.273806
C  0.628458 -2.134325 0.442204
C  -2.348485 -1.484734 -1.116534
C  1.842661 2.170103 -0.07395
C  -0.068044 -3.328068 0.599518
C  -0.137634 3.54514 0.099843
C  1.528655 -1.972635 -0.605076
C  -3.441321 -0.809744 -1.904351
C  2.590078 3.183164 0.50976
C  0.131366 -4.359915 -0.305501
C  0.618512 4.552152 0.680232
C  1.718737 -3.009281 -1.507689
C  1.979996 4.371388 0.887198
C  1.019647 -4.199639 -1.360735
H  -1.391352 -1.451637 -1.641478
H  -2.581249 -2.533468 -0.94062
H  2.31896 1.245249 -0.370106
H  -0.760278 -3.451374 1.421779
H  -1.19708 3.685769 -0.066751
H  2.07797 -1.047776 -0.716923
H  -4.398585 -0.871501 -1.387566
H  -3.218817 0.238761 -2.102328
H  -3.546503 -1.314975 -2.864674
H  3.650491 3.040547 0.669345
H  -0.409604 -5.289065 -0.185813
H  0.142083 5.478603 0.971592
H  2.415772 -2.884932 -2.325691
H  2.566371 5.159114 1.341291
H  1.170872 -5.005173 -2.067114
elementType: S P O C H
totalener: -1830.89355026 hartree
nucrepener: 1903.53914552 hartree
electener: -3734.43269578 hartree
oneelecener: -6302.07373764 hartree
twoeener: 2567.64104186 hartree
cpcmener: -0.03621654 hartree
kineticenergy: 1825.73465757 hartree
xcener: -123.399350634943 hartree
chargesum: 0.0000000
charge: -0.177964 -0.146665 0.724388 -0.352987 -0.645059 0.062499 0.032507 0.022167 -0.104770 -0.090784 -0.122060 -0.114010 -0.232863 -0.195457 -0.181359 -0.176251 -0.196060 -0.107873 -0.103887 0.106645 0.119172 0.178089 0.142414 0.144435 0.171804 0.095406 0.076857 0.097190 0.160290 0.162229 0.163078 0.160345 0.164223 0.164310
qa: -0.1780 -0.1467 0.7244 -0.3530 -0.6451 0.0625 0.0325 0.0222 -0.1048 -0.0908 -0.1221 -0.1140 -0.2329 -0.1955 -0.1814 -0.1763 -0.1961 -0.1079 -0.1039 0.1066 0.1192 0.1781 0.1424 0.1444 0.1718 0.0954 0.0769 0.0972 0.1603 0.1622 0.1631 0.1603 0.1642 0.1643
va: 2.2750 2.3002 5.4050 2.1021 1.9700 3.7232 3.6684 3.8326 3.8353 3.8456 3.9265 3.8457 3.9707 3.9623 3.9196 3.9236 3.9670 3.8624 3.8537 0.9789 0.9879 0.9736 1.0068 1.0038 0.9771 1.0036 1.0162 1.0067 0.9930 0.9884 0.9883 0.9928 0.9869 0.9868
dispcorr: -0.018711612 hartree
energy: -1830.912261868618
dipole: -0.75825 2.01082 1.25257 -4.87232 3.30920 -1.56312 -10.76937 8.33202 -2.43736
magnitude: 3.15483 au
magnitude: 8.01895 debye
