program: Orca
programVersion: 5.0.2
elementType: S S P O O C C C C C C C C C C C C C C H H H H H H H H H H H H H H H
charge: 0
multiplicity: 1
keywords: wb97x-d3
keywords: def2-TZVPP
keywords: def2/J RIJCOSX
keywords: DEFGRID2
keywords: scfconv7
keywords: smallprint printgap noloewdin
keywords: NOSOSCF
formula: C14H15O2PS2
InChI: InChI=1/C14H15O2PS2/c1-2-16-17(15,18-13-9-5-3-6-10-13)19-14-11-7-4-8-12-14/h3-12H,2H2,1H3
34 atoms
S  -0.51975 1.764757 1.870099
S  1.365693 -0.703601 0.795578
P  -0.626485 -0.120148 0.982946
O  -1.057953 0.08379 -0.537512
O  -1.485902 -1.014213 1.800789
C  0.098239 2.759158 0.529161
C  1.034213 -2.269007 0.009799
C  -2.425556 -0.122796 -0.971293
C  -0.805447 3.369576 -0.33379
C  0.790199 -3.38818 0.79814
C  1.465158 2.969651 0.391455
C  1.037379 -2.362883 -1.377296
C  -2.577188 -1.497653 -1.570044
C  -0.33254 4.193089 -1.344592
C  0.549878 -4.611061 0.189215
C  1.92871 3.792787 -0.625188
C  0.792808 -3.590109 -1.976554
C  1.03229 4.403889 -1.491338
C  0.548985 -4.712179 -1.195669
H  -3.118273 0.028791 -0.142109
H  -2.616897 0.655581 -1.708098
H  -1.868648 3.207137 -0.21458
H  0.796181 -3.307639 1.876862
H  2.164133 2.501347 1.071959
H  1.226102 -1.487542 -1.984127
H  -3.600825 -1.623077 -1.924149
H  -1.910339 -1.637437 -2.420804
H  -2.377331 -2.279533 -0.836589
H  -1.032803 4.671734 -2.016119
H  0.362841 -5.484696 0.799174
H  2.991979 3.957889 -0.736863
H  0.790208 -3.667733 -3.055626
H  1.397361 5.048494 -2.279922
H  0.35956 -5.667631 -1.666685
elementType: S P O C H
totalener: -1830.89595100 hartree
nucrepener: 1887.17064959 hartree
electener: -3718.06660059 hartree
oneelecener: -6269.86791450 hartree
twoeener: 2551.80131391 hartree
cpcmener: -0.03185448 hartree
kineticenergy: 1825.73424108 hartree
xcener: -123.392759436853 hartree
chargesum: 0.0000000
charge: -0.139719 -0.149722 0.693958 -0.340456 -0.643438 0.063774 0.143589 0.058123 -0.132628 -0.162064 -0.116711 -0.174418 -0.257311 -0.166257 -0.155860 -0.173058 -0.150062 -0.123021 -0.132551 0.101171 0.105168 0.147604 0.145769 0.149204 0.145398 0.108748 0.090363 0.082408 0.163290 0.163205 0.162813 0.163889 0.164866 0.163935
qa: -0.1397 -0.1497 0.6940 -0.3405 -0.6434 0.0638 0.1436 0.0581 -0.1326 -0.1621 -0.1167 -0.1744 -0.2573 -0.1663 -0.1559 -0.1731 -0.1501 -0.1230 -0.1326 0.1012 0.1052 0.1476 0.1458 0.1492 0.1454 0.1087 0.0904 0.0824 0.1633 0.1632 0.1628 0.1639 0.1649 0.1639
va: 2.3240 2.2933 5.4013 2.0784 1.9518 3.6901 3.6329 3.8225 3.9176 3.9644 3.9087 3.9152 3.9371 3.9231 3.9163 3.9383 3.8793 3.8756 3.8824 1.0045 0.9926 0.9989 1.0060 0.9995 1.0083 1.0106 1.0002 1.0109 0.9883 0.9882 0.9888 0.9875 0.9866 0.9874
dispcorr: -0.018240289 hartree
energy: -1830.914191291281
dipole: -5.46526 5.67319 0.20793 -4.60067 5.13622 0.53554 -15.78509 13.16400 -2.62109
magnitude: 2.68331 au
magnitude: 6.82042 debye
