program: Orca
programVersion: 5.0.2
elementType: S S P O O C C C C C C C C C C C C C C H H H H H H H H H H H H H H H
charge: 0
multiplicity: 1
keywords: wb97x-d3
keywords: def2-TZVPP
keywords: def2/J RIJCOSX
keywords: DEFGRID2
keywords: scfconv7
keywords: smallprint printgap noloewdin
keywords: NOSOSCF
formula: C14H15O2PS2
InChI: InChI=1/C14H15O2PS2/c1-2-16-17(15,18-13-9-5-3-6-10-13)19-14-11-7-4-8-12-14/h3-12H,2H2,1H3
34 atoms
S  0.751874 0.6348 1.311754
S  -1.025947 -2.137489 1.194223
P  -1.043146 -0.141498 0.589479
O  -0.817344 -0.09523 -0.988034
O  -2.279162 0.5137 1.089239
C  0.560378 2.256284 0.598611
C  0.366046 -2.743832 0.266112
C  -1.927741 0.129802 -1.893513
C  1.174842 2.549571 -0.612893
C  0.186484 -3.166865 -1.046108
C  -0.199204 3.213317 1.262101
C  1.610822 -2.836495 0.877673
C  -2.054377 1.594955 -2.222882
C  1.028041 3.815568 -1.161173
C  1.268157 -3.66991 -1.753396
C  -0.34122 4.475951 0.704299
C  2.686531 -3.343099 0.162351
C  0.270795 4.777008 -0.505131
C  2.517028 -3.755613 -1.152157
H  -1.695583 -0.457004 -2.780547
H  -2.851415 -0.263661 -1.467187
H  1.761069 1.797654 -1.12415
H  -0.788434 -3.107696 -1.511667
H  -0.669917 2.978654 2.207351
H  1.74178 -2.518603 1.903557
H  -1.14846 1.978045 -2.691936
H  -2.87722 1.73184 -2.925127
H  -2.269568 2.190979 -1.335606
H  1.504692 4.048757 -2.103887
H  1.13305 -3.996885 -2.775647
H  -0.931144 5.224079 1.216771
H  3.657102 -3.413853 0.634827
H  0.157608 5.762879 -0.936538
H  3.358154 -4.14838 -1.707827
elementType: S P O C H
totalener: -1830.89606345 hartree
nucrepener: 1895.36283202 hartree
electener: -3726.25889547 hartree
oneelecener: -6286.27217965 hartree
twoeener: 2560.01328418 hartree
cpcmener: -0.03149957 hartree
kineticenergy: 1825.74463338 hartree
xcener: -123.395716430157 hartree
chargesum: -0.0000000
charge: -0.147306 -0.134739 0.695772 -0.340180 -0.645443 0.138723 0.059997 0.058481 -0.165416 -0.127667 -0.156841 -0.121100 -0.259735 -0.160129 -0.170291 -0.164086 -0.169839 -0.121926 -0.123210 0.105897 0.100536 0.143597 0.148280 0.145588 0.148791 0.091008 0.109071 0.081277 0.163247 0.163008 0.162697 0.162911 0.164080 0.164949
qa: -0.1473 -0.1347 0.6958 -0.3402 -0.6454 0.1387 0.0600 0.0585 -0.1654 -0.1277 -0.1568 -0.1211 -0.2597 -0.1601 -0.1703 -0.1641 -0.1698 -0.1219 -0.1232 0.1059 0.1005 0.1436 0.1483 0.1456 0.1488 0.0910 0.1091 0.0813 0.1632 0.1630 0.1627 0.1629 0.1641 0.1649
va: 2.2962 2.3262 5.3926 2.0783 1.9497 3.6371 3.6931 3.8218 3.9181 3.9180 3.9513 3.8916 3.9332 3.8821 3.9230 3.9234 3.9340 3.8688 3.8751 0.9934 1.0053 1.0086 0.9966 1.0074 1.0020 1.0006 1.0118 1.0126 0.9879 0.9886 0.9888 0.9884 0.9871 0.9865
dispcorr: -0.018501114 hartree
energy: -1830.914564563139
dipole: 1.17077 0.25031 1.42108 7.43243 -7.39542 0.03700 -15.33638 13.06557 -2.27081
magnitude: 2.67907 au
magnitude: 6.80965 debye
