program: Orca
programVersion: 5.0.2
elementType: S S P O O C C C C C C C C C C C C C C H H H H H H H H H H H H H H H
charge: 0
multiplicity: 1
keywords: wb97x-d3
keywords: def2-TZVPP
keywords: def2/J RIJCOSX
keywords: DEFGRID2
keywords: scfconv7
keywords: smallprint printgap noloewdin
keywords: NOSOSCF
formula: C14H15O2PS2
InChI: InChI=1/C14H15O2PS2/c1-2-16-17(15,18-13-9-5-3-6-10-13)19-14-11-7-4-8-12-14/h3-12H,2H2,1H3
34 atoms
S  -0.078531 0.970321 -1.236169
S  0.074087 -0.992854 1.549164
P  -1.173332 0.16893 0.355471
O  -2.068488 -0.911466 -0.391515
O  -1.84351 1.195146 1.192302
C  0.624069 2.356093 -0.371477
C  0.696858 -2.167502 0.367408
C  -3.272948 -0.53263 -1.111835
C  -0.053672 3.570016 -0.356446
C  1.922004 -1.940429 -0.248476
C  1.856722 2.225753 0.255872
C  -0.022891 -3.328797 0.107129
C  -4.483358 -0.619726 -0.219248
C  0.510814 4.659167 0.290244
C  2.420584 -2.877216 -1.142474
C  2.409337 3.319074 0.908194
C  0.48264 -4.25846 -0.789105
C  1.738968 4.534247 0.925257
C  1.700651 -4.032184 -1.416523
H  -3.1606 0.467776 -1.534484
H  -3.339588 -1.236947 -1.938278
H  -1.011569 3.665713 -0.84921
H  2.484451 -1.041513 -0.033553
H  2.384126 1.281245 0.23592
H  -0.968653 -3.508679 0.600403
H  -4.586949 -1.613562 0.214688
H  -4.448221 0.113557 0.585736
H  -5.374626 -0.421432 -0.814529
H  -0.012944 5.605622 0.299831
H  3.372801 -2.701497 -1.624928
H  3.366435 3.218736 1.401048
H  -0.077368 -5.160623 -0.996182
H  2.174537 5.386247 1.430366
H  2.090829 -4.759438 -2.116174
elementType: S P O C H
totalener: -1830.89629564 hartree
nucrepener: 1879.23663174 hartree
electener: -3710.13292738 hartree
oneelecener: -6254.15683596 hartree
twoeener: 2544.02390858 hartree
cpcmener: -0.03293433 hartree
kineticenergy: 1825.75489397 hartree
xcener: -123.397633715938 hartree
chargesum: -0.0000000
charge: -0.157185 -0.131636 0.710594 -0.347657 -0.643741 0.049371 0.016089 0.048520 -0.110723 -0.097089 -0.082149 -0.095242 -0.243763 -0.186906 -0.202969 -0.219570 -0.188999 -0.097510 -0.102527 0.096536 0.109516 0.145058 0.180306 0.168847 0.143186 0.090772 0.079128 0.096785 0.162281 0.160506 0.159364 0.162344 0.163935 0.164525
qa: -0.1572 -0.1316 0.7106 -0.3477 -0.6437 0.0494 0.0161 0.0485 -0.1107 -0.0971 -0.0821 -0.0952 -0.2438 -0.1869 -0.2030 -0.2196 -0.1890 -0.0975 -0.1025 0.0965 0.1095 0.1451 0.1803 0.1688 0.1432 0.0908 0.0791 0.0968 0.1623 0.1605 0.1594 0.1623 0.1639 0.1645
va: 2.2958 2.3208 5.3895 2.0963 1.9578 3.7104 3.7199 3.8479 3.9150 3.8229 3.8290 3.8885 3.9415 3.9324 3.9621 3.9852 3.9315 3.8461 3.8565 1.0020 0.9918 0.9999 0.9692 0.9781 1.0060 1.0030 1.0195 1.0073 0.9886 0.9925 0.9935 0.9888 0.9867 0.9865
dispcorr: -0.017141283 hartree
energy: -1830.913436922578
dipole: -4.49900 5.20166 0.70265 -1.62242 0.77507 -0.84735 -4.92576 3.29684 -1.62892
magnitude: 1.96599 au
magnitude: 4.99714 debye
