program: Orca
programVersion: 5.0.2
elementType: S S P O O C C C C C C C C C C C C C C H H H H H H H H H H H H H H H
charge: 0
multiplicity: 1
keywords: wb97x-d3
keywords: def2-TZVPP
keywords: def2/J RIJCOSX
keywords: DEFGRID2
keywords: scfconv7
keywords: smallprint printgap noloewdin
keywords: NOSOSCF
formula: C14H15O2PS2
InChI: InChI=1/C14H15O2PS2/c1-2-16-17(15,18-13-9-5-3-6-10-13)19-14-11-7-4-8-12-14/h3-12H,2H2,1H3
34 atoms
S  0.527392 0.988799 -1.257295
S  -0.755633 -2.013195 -1.123407
P  -0.661033 -0.224207 -0.051837
O  -2.119863 0.379286 -0.262074
O  -0.196547 -0.368057 1.352125
C  0.428606 2.451592 -0.245864
C  0.698735 -2.795292 -0.45906
C  -3.108325 0.334648 0.79848
C  1.333917 2.638938 0.793032
C  1.938012 -2.581215 -1.052115
C  -0.553172 3.399454 -0.512975
C  0.570974 -3.643786 0.634551
C  -3.030624 1.572772 1.653605
C  1.253778 3.787015 1.567598
C  3.058205 -3.21772 -0.53726
C  -0.625831 4.543759 0.268511
C  1.695111 -4.283709 1.13554
C  0.274507 4.737245 1.307731
C  2.937613 -4.068961 0.553117
H  -4.066819 0.267723 0.287353
H  -2.98624 -0.572152 1.392988
H  2.097957 1.899334 0.991644
H  2.031183 -1.924567 -1.907306
H  -1.254486 3.248023 -1.32268
H  -0.397294 -3.810195 1.087894
H  -3.81299 1.528185 2.411967
H  -2.072448 1.653525 2.16679
H  -3.189582 2.475179 1.063558
H  1.95692 3.937553 2.37577
H  4.025546 -3.048442 -0.99177
H  -1.388899 5.282997 0.064231
H  1.598603 -4.949168 1.983159
H  0.214083 5.630993 1.914625
H  3.812228 -4.568089 0.948655
elementType: S P O C H
totalener: -1830.89603761 hartree
nucrepener: 1870.77498293 hartree
electener: -3701.67102054 hartree
oneelecener: -6237.68093424 hartree
twoeener: 2536.00991370 hartree
cpcmener: -0.03086461 hartree
kineticenergy: 1825.74338736 hartree
xcener: -123.393624545611 hartree
chargesum: -0.0000000
charge: -0.141227 -0.142343 0.710363 -0.361998 -0.632418 0.147424 0.076233 0.049872 -0.173579 -0.119704 -0.175541 -0.138771 -0.259951 -0.148011 -0.177462 -0.150481 -0.164448 -0.134389 -0.122569 0.109768 0.102125 0.144316 0.149504 0.144596 0.144930 0.108953 0.083745 0.089347 0.163455 0.163352 0.162958 0.163325 0.164238 0.164389
qa: -0.1412 -0.1423 0.7104 -0.3620 -0.6324 0.1474 0.0762 0.0499 -0.1736 -0.1197 -0.1755 -0.1388 -0.2600 -0.1480 -0.1775 -0.1505 -0.1644 -0.1344 -0.1226 0.1098 0.1021 0.1443 0.1495 0.1446 0.1449 0.1090 0.0837 0.0893 0.1635 0.1634 0.1630 0.1633 0.1642 0.1644
va: 2.3047 2.3141 5.3944 2.0895 1.9460 3.6333 3.6961 3.8409 3.9696 3.9255 3.9290 3.9545 3.9209 3.9048 3.9452 3.8887 3.9201 3.8857 3.8729 0.9930 1.0026 1.0054 0.9993 1.0099 1.0024 1.0109 1.0139 1.0011 0.9879 0.9888 0.9879 0.9879 0.9873 0.9868
dispcorr: -0.017353295 hartree
energy: -1830.913390909776
dipole: -3.25966 2.89677 -0.36289 6.75917 -6.18181 0.57736 10.85297 -10.61969 0.23328
magnitude: 0.72073 au
magnitude: 1.83195 debye
