program: Orca
programVersion: 5.0.2
elementType: S S P O O C C C C C C C C C C C C C C H H H H H H H H H H H H H H H
charge: 0
multiplicity: 1
keywords: wb97x-d3
keywords: def2-TZVPP
keywords: def2/J RIJCOSX
keywords: DEFGRID2
keywords: scfconv7
keywords: smallprint printgap noloewdin
keywords: NOSOSCF
formula: C14H15O2PS2
InChI: InChI=1/C14H15O2PS2/c1-2-16-17(15,18-13-9-5-3-6-10-13)19-14-11-7-4-8-12-14/h3-12H,2H2,1H3
34 atoms
S  0.567825 1.012181 -1.220696
S  -0.701743 -1.991493 -1.14133
P  -0.617429 -0.222253 -0.033443
O  -2.076786 0.380857 -0.242079
O  -0.16013 -0.387424 1.370316
C  0.403006 2.489615 -0.238486
C  0.719833 -2.817813 -0.459744
C  -3.066756 0.340334 0.81664
C  1.257941 2.710842 0.835478
C  1.987968 -2.571734 -0.974365
C  -0.574626 3.420371 -0.57269
C  0.534982 -3.745915 0.558468
C  -2.978638 1.573928 1.678006
C  1.13083 3.875989 1.577877
C  3.078515 -3.253041 -0.453004
C  -0.69311 4.582626 0.175655
C  1.629787 -4.431966 1.063616
C  0.157034 4.810261 1.249674
C  2.900662 -4.183486 0.562336
H  -4.025126 0.284915 0.30384
H  -2.954016 -0.570397 1.406849
H  2.020529 1.985313 1.084709
H  2.12726 -1.856726 -1.77468
H  -1.23673 3.241861 -1.409427
H  -0.455555 -3.937209 0.949086
H  -3.125664 2.480722 1.091577
H  -3.763393 1.534944 2.434184
H  -2.0210 1.64176 2.194122
H  1.795041 4.053539 2.41308
H  4.067857 -3.058587 -0.845325
H  -1.452358 5.30933 -0.081128
H  1.487767 -5.15994 1.851129
H  0.061765 5.717785 1.831077
H  3.752701 -4.717942 0.961095
elementType: S P O C H
totalener: -1830.89575547 hartree
nucrepener: 1867.31235695 hartree
electener: -3698.20811242 hartree
oneelecener: -6230.71895818 hartree
twoeener: 2532.51084576 hartree
cpcmener: -0.03080744 hartree
kineticenergy: 1825.73975448 hartree
xcener: -123.392706346699 hartree
chargesum: -0.0000000
charge: -0.141984 -0.141508 0.709627 -0.362122 -0.631804 0.145503 0.062812 0.049365 -0.170282 -0.110328 -0.172896 -0.128785 -0.260143 -0.151726 -0.181261 -0.153116 -0.168283 -0.131502 -0.120785 0.109719 0.102532 0.144782 0.149740 0.144109 0.144069 0.089318 0.108829 0.083840 0.163573 0.163429 0.162889 0.163011 0.164413 0.164964
qa: -0.1420 -0.1415 0.7096 -0.3621 -0.6318 0.1455 0.0628 0.0494 -0.1703 -0.1103 -0.1729 -0.1288 -0.2601 -0.1517 -0.1813 -0.1531 -0.1683 -0.1315 -0.1208 0.1097 0.1025 0.1448 0.1497 0.1441 0.1441 0.0893 0.1088 0.0838 0.1636 0.1634 0.1629 0.1630 0.1644 0.1650
va: 2.3046 2.3149 5.3906 2.0901 1.9475 3.6335 3.7028 3.8408 3.9645 3.9187 3.9310 3.9498 3.9201 3.9081 3.9498 3.8902 3.9246 3.8811 3.8697 0.9930 1.0025 1.0056 0.9984 1.0100 1.0026 1.0014 1.0114 1.0139 0.9880 0.9889 0.9879 0.9881 0.9872 0.9866
dispcorr: -0.017305694 hartree
energy: -1830.913061165795
dipole: -3.60246 3.18916 -0.41330 6.65123 -6.06714 0.58409 10.75388 -10.53578 0.21810
magnitude: 0.74803 au
magnitude: 1.90133 debye
