program: Orca
programVersion: 5.0.2
elementType: S S P O O C C C C C C C C C C C C C C H H H H H H H H H H H H H H H
charge: 0
multiplicity: 1
keywords: wb97x-d3
keywords: def2-TZVPP
keywords: def2/J RIJCOSX
keywords: DEFGRID2
keywords: scfconv7
keywords: smallprint printgap noloewdin
keywords: NOSOSCF
formula: C14H15O2PS2
InChI: InChI=1/C14H15O2PS2/c1-2-16-17(15,18-13-9-5-3-6-10-13)19-14-11-7-4-8-12-14/h3-12H,2H2,1H3
34 atoms
S  0.268226 1.089811 -1.421903
S  -0.834363 -1.982174 -1.148902
P  -0.623689 -0.211224 -0.06045
O  -2.114242 0.3423 0.03339
O  0.107504 -0.371126 1.221639
C  0.284606 2.512016 -0.34837
C  0.668801 -2.778566 -0.622317
C  -2.877918 0.228117 1.262201
C  -0.735572 3.451286 -0.447446
C  1.886573 -2.429207 -1.193364
C  1.31114 2.670888 0.575796
C  0.598973 -3.766323 0.352487
C  -2.69764 1.456898 2.115727
C  -0.723509 4.559936 0.386553
C  3.04471 -3.064117 -0.76915
C  1.311615 3.780675 1.407931
C  1.760663 -4.408232 0.757011
C  0.29622 4.723503 1.31461
C  2.982817 -4.053348 0.203101
H  -3.912543 0.116107 0.943526
H  -2.597253 -0.677649 1.801906
H  -1.532023 3.318996 -1.167547
H  1.935279 -1.66603 -1.958784
H  2.105049 1.939193 0.6422
H  -0.35251 -4.032616 0.792627
H  -1.665132 1.573601 2.445056
H  -2.999724 2.359218 1.584368
H  -3.32388 1.367567 3.00382
H  -1.515026 5.293641 0.312216
H  3.99597 -2.785646 -1.201936
H  2.106936 3.907765 2.13012
H  1.709298 -5.180775 1.512479
H  0.300823 5.587701 1.965481
H  3.888009 -4.548833 0.527887
elementType: S P O C H
totalener: -1830.89522891 hartree
nucrepener: 1872.68284343 hartree
electener: -3703.57807234 hartree
oneelecener: -6241.50433770 hartree
twoeener: 2537.92626536 hartree
cpcmener: -0.03066542 hartree
kineticenergy: 1825.75297457 hartree
xcener: -123.395404873671 hartree
chargesum: -0.0000000
charge: -0.139454 -0.137751 0.714997 -0.363298 -0.631820 0.141316 0.060383 0.048686 -0.170149 -0.112264 -0.172661 -0.129676 -0.259577 -0.153666 -0.179477 -0.151261 -0.168753 -0.131849 -0.122543 0.109797 0.101900 0.144125 0.150299 0.146020 0.144398 0.082606 0.089524 0.108693 0.162830 0.163507 0.163615 0.162797 0.163857 0.164852
qa: -0.1395 -0.1378 0.7150 -0.3633 -0.6318 0.1413 0.0604 0.0487 -0.1701 -0.1123 -0.1727 -0.1297 -0.2596 -0.1537 -0.1795 -0.1513 -0.1688 -0.1318 -0.1225 0.1098 0.1019 0.1441 0.1503 0.1460 0.1444 0.0826 0.0895 0.1087 0.1628 0.1635 0.1636 0.1628 0.1639 0.1649
va: 2.3030 2.3168 5.3851 2.0934 1.9441 3.6368 3.7070 3.8466 3.9340 3.9149 3.9565 3.9521 3.9216 3.8901 3.9532 3.9091 3.9277 3.8821 3.8710 0.9932 1.0023 1.0097 0.9999 1.0056 1.0031 1.0134 1.0013 1.0111 0.9878 0.9890 0.9881 0.9881 0.9874 0.9867
dispcorr: -0.017440858 hartree
energy: -1830.912669769115
dipole: -1.78990 1.37986 -0.41004 6.14082 -5.62331 0.51751 12.26546 -11.80847 0.45699
magnitude: 0.80299 au
magnitude: 2.04104 debye
