program: Orca
programVersion: 5.0.2
elementType: S S P O O C C C C C C C C C C C C C C H H H H H H H H H H H H H H H
charge: 0
multiplicity: 1
keywords: wb97x-d3
keywords: def2-TZVPP
keywords: def2/J RIJCOSX
keywords: DEFGRID2
keywords: scfconv7
keywords: smallprint printgap noloewdin
keywords: NOSOSCF
formula: C14H15O2PS2
InChI: InChI=1/C14H15O2PS2/c1-2-16-17(15,18-13-9-5-3-6-10-13)19-14-11-7-4-8-12-14/h3-12H,2H2,1H3
34 atoms
S  -1.454817 1.751273 -0.123653
S  -0.503376 -1.264154 -1.423059
P  -1.525104 -0.329079 0.137468
O  -3.014086 -0.674631 -0.305334
O  -1.064171 -0.772773 1.477348
C  0.304023 1.967789 0.020502
C  0.988358 -1.738368 -0.577467
C  -4.185515 0.037758 0.160258
C  0.942542 1.828997 1.248308
C  2.161272 -1.042617 -0.839978
C  1.019675 2.330824 -1.114834
C  0.987392 -2.826093 0.289401
C  -4.34225 0.019134 1.659902
C  2.312106 2.030181 1.328077
C  3.339195 -1.426279 -0.214853
C  2.386244 2.552488 -1.018883
C  2.168267 -3.199148 0.913358
C  3.03426 2.392819 0.197975
C  3.342032 -2.498321 0.666369
H  -4.160307 1.059801 -0.225244
H  -5.019094 -0.468589 -0.321731
H  0.379041 1.571938 2.134574
H  2.155659 -0.203446 -1.521859
H  0.516572 2.436495 -2.066803
H  0.076467 -3.379171 0.474683
H  -4.343631 -0.99811 2.050104
H  -3.568002 0.591691 2.170745
H  -5.300773 0.474705 1.909108
H  2.814006 1.911924 2.279055
H  4.251693 -0.88041 -0.414494
H  2.944226 2.837533 -1.900775
H  2.170583 -4.040673 1.593207
H  4.101409 2.55622 0.26834
H  4.260515 -2.793641 1.156048
elementType: S P O C H
totalener: -1830.89259427 hartree
nucrepener: 1922.57728122 hartree
electener: -3753.46987549 hartree
oneelecener: -6341.16065397 hartree
twoeener: 2587.69077848 hartree
cpcmener: -0.03106313 hartree
kineticenergy: 1825.75176876 hartree
xcener: -123.400766659775 hartree
chargesum: -0.0000000
charge: -0.151802 -0.129611 0.723515 -0.357692 -0.622738 0.086953 0.057893 0.014032 -0.120691 -0.121348 -0.135050 -0.135480 -0.234880 -0.162912 -0.197609 -0.157412 -0.170715 -0.139407 -0.112608 0.104412 0.115697 0.142832 0.170931 0.138757 0.145341 0.097205 0.078643 0.100523 0.161272 0.161573 0.161090 0.162580 0.162111 0.164596
qa: -0.1518 -0.1296 0.7235 -0.3577 -0.6227 0.0870 0.0579 0.0140 -0.1207 -0.1213 -0.1350 -0.1355 -0.2349 -0.1629 -0.1976 -0.1574 -0.1707 -0.1394 -0.1126 0.1044 0.1157 0.1428 0.1709 0.1388 0.1453 0.0972 0.0786 0.1005 0.1613 0.1616 0.1611 0.1626 0.1621 0.1646
va: 2.3033 2.3285 5.3528 2.1288 1.9517 3.6638 3.7240 3.8751 3.8716 3.8252 3.8976 3.9053 3.9089 3.8749 3.9276 3.8761 3.9206 3.8369 3.8709 0.9893 0.9878 1.0115 0.9891 1.0129 1.0041 1.0049 1.0160 1.0087 0.9894 0.9921 0.9884 0.9881 0.9887 0.9860
dispcorr: -0.019301359 hartree
energy: -1830.911895630189
dipole: 2.57225 -1.98638 0.58587 1.39706 -0.54901 0.84805 6.47420 -6.97283 -0.49863
magnitude: 1.14502 au
magnitude: 2.91041 debye
