program: Orca
programVersion: 5.0.2
elementType: S S P O O C C C C C C C C C C C C C C H H H H H H H H H H H H H H H
charge: 0
multiplicity: 1
keywords: wb97x-d3
keywords: def2-TZVPP
keywords: def2/J RIJCOSX
keywords: DEFGRID2
keywords: scfconv7
keywords: smallprint printgap noloewdin
keywords: NOSOSCF
formula: C14H15O2PS2
InChI: InChI=1/C14H15O2PS2/c1-2-16-17(15,18-13-9-5-3-6-10-13)19-14-11-7-4-8-12-14/h3-12H,2H2,1H3
34 atoms
S  -1.160093 1.683365 1.420065
S  1.144824 -0.638901 1.04042
P  -0.867193 -0.237086 0.657812
O  -0.901304 -0.15486 -0.934748
O  -1.83622 -1.181747 1.271549
C  -0.080836 2.645316 0.381943
C  1.141854 -2.266886 0.315511
C  -2.044027 -0.629214 -1.68957
C  1.194247 2.968518 0.832334
C  0.851837 -3.367149 1.114318
C  -0.544687 3.124475 -0.837992
C  1.43094 -2.42522 -1.035582
C  -3.248921 0.267596 -1.552551
C  2.012926 3.766785 0.046701
C  0.851178 -4.635892 0.552939
C  0.281403 3.920524 -1.616649
C  1.42066 -3.697218 -1.588815
C  1.558883 4.240661 -1.17667
C  1.130111 -4.80087 -0.797269
H  -1.694284 -0.653953 -2.71952
H  -2.273101 -1.65274 -1.390166
H  1.545645 2.604906 1.789151
H  0.633981 -3.235637 2.165899
H  -1.544299 2.886417 -1.175696
H  1.661965 -1.565791 -1.650277
H  -4.037173 -0.107124 -2.206194
H  -3.644278 0.279157 -0.536761
H  -3.02659 1.291115 -1.853334
H  3.005653 4.019022 0.394171
H  0.629515 -5.494651 1.172206
H  -0.076492 4.293724 -2.566748
H  1.639877 -3.824539 -2.640506
H  2.198934 4.865108 -1.785681
H  1.124248 -5.79103 -1.233093
elementType: S P O C H
totalener: -1830.89486286 hartree
nucrepener: 1886.21575351 hartree
electener: -3717.11061637 hartree
oneelecener: -6268.00564231 hartree
twoeener: 2550.89502594 hartree
cpcmener: -0.03218501 hartree
kineticenergy: 1825.73992195 hartree
xcener: -123.395030345951 hartree
chargesum: -0.0000000
charge: -0.134685 -0.151397 0.703189 -0.345923 -0.645420 0.021031 0.135390 0.050295 -0.099063 -0.160052 -0.109671 -0.166358 -0.265624 -0.182292 -0.156828 -0.200470 -0.151039 -0.106923 -0.132729 0.112331 0.103905 0.147823 0.145977 0.176567 0.145342 0.107134 0.085779 0.095412 0.162907 0.163491 0.161243 0.162991 0.163883 0.163784
qa: -0.1347 -0.1514 0.7032 -0.3459 -0.6454 0.0210 0.1354 0.0503 -0.0991 -0.1601 -0.1097 -0.1664 -0.2656 -0.1823 -0.1568 -0.2005 -0.1510 -0.1069 -0.1327 0.1123 0.1039 0.1478 0.1460 0.1766 0.1453 0.1071 0.0858 0.0954 0.1629 0.1635 0.1612 0.1630 0.1639 0.1638
va: 2.3182 2.2968 5.3818 2.0673 1.9510 3.7402 3.6559 3.8045 3.8705 3.9657 3.8760 3.9375 3.9415 3.9430 3.9098 3.9604 3.9039 3.8629 3.8863 0.9914 1.0053 1.0023 1.0051 0.9691 1.0073 1.0110 1.0146 0.9995 0.9886 0.9880 0.9912 0.9881 0.9866 0.9876
dispcorr: -0.017680168 hartree
energy: -1830.912543023282
dipole: -2.73479 3.65872 0.92393 -1.45549 1.93994 0.48445 -14.24778 11.88284 -2.36494
magnitude: 2.58482 au
magnitude: 6.57008 debye
