program: Orca
programVersion: 5.0.2
elementType: S S P O O C C C C C C C C C C C C C C H H H H H H H H H H H H H H H
charge: 0
multiplicity: 1
keywords: wb97x-d3
keywords: def2-TZVPP
keywords: def2/J RIJCOSX
keywords: DEFGRID2
keywords: scfconv7
keywords: smallprint printgap noloewdin
keywords: NOSOSCF
formula: C14H15O2PS2
InChI: InChI=1/C14H15O2PS2/c1-2-16-17(15,18-13-9-5-3-6-10-13)19-14-11-7-4-8-12-14/h3-12H,2H2,1H3
34 atoms
S  0.183639 0.818434 -1.0089
S  -1.083271 -2.127873 -0.506494
P  -0.865236 -0.273079 0.434383
O  -2.346465 0.300277 0.503191
O  -0.232067 -0.287892 1.775143
C  0.413649 2.305657 -0.060444
C  0.570528 -2.730176 -0.240143
C  -3.211885 0.460078 -0.642539
C  1.56418 2.461704 0.704167
C  1.521957 -2.599768 -1.245712
C  -0.544687 3.311574 -0.117409
C  0.882087 -3.364583 0.95774
C  -4.243437 1.507825 -0.317601
C  1.756606 3.638407 1.412736
C  2.799359 -3.103183 -1.043592
C  -0.345124 4.482871 0.598722
C  2.161099 -3.866843 1.148674
C  0.803753 4.64748 1.360794
C  3.119092 -3.734958 0.151466
H  -2.625712 0.755363 -1.51584
H  -3.684678 -0.500655 -0.856139
H  2.305812 1.674753 0.739732
H  1.270224 -2.111418 -2.178382
H  -1.435887 3.185814 -0.718823
H  0.133501 -3.471512 1.731577
H  -3.781868 2.477126 -0.128852
H  -4.915873 1.615401 -1.168874
H  -4.842841 1.228191 0.549023
H  2.651986 3.765816 2.006379
H  3.543855 -3.000093 -1.822035
H  -1.0879 5.268427 0.557994
H  2.408425 -4.36156 2.078957
H  0.956827 5.564424 1.914476
H  4.116046 -4.126291 0.306445
elementType: S P O C H
totalener: -1830.89599393 hartree
nucrepener: 1866.02756435 hartree
electener: -3696.92355827 hartree
oneelecener: -6227.79043710 hartree
twoeener: 2530.86687882 hartree
cpcmener: -0.03594320 hartree
kineticenergy: 1825.72849194 hartree
xcener: -123.392677406388 hartree
chargesum: 0.0000000
charge: -0.164208 -0.163222 0.701923 -0.343197 -0.628079 0.100229 0.109047 -0.001699 -0.145125 -0.135157 -0.120884 -0.153128 -0.241116 -0.161707 -0.163470 -0.185641 -0.156449 -0.120757 -0.129983 0.119042 0.125436 0.144162 0.148806 0.163378 0.146939 0.085452 0.093500 0.094018 0.163384 0.163173 0.162337 0.163886 0.164338 0.164772
qa: -0.1642 -0.1632 0.7019 -0.3432 -0.6281 0.1002 0.1090 -0.0017 -0.1451 -0.1352 -0.1209 -0.1531 -0.2411 -0.1617 -0.1635 -0.1856 -0.1564 -0.1208 -0.1300 0.1190 0.1254 0.1442 0.1488 0.1634 0.1469 0.0855 0.0935 0.0940 0.1634 0.1632 0.1623 0.1639 0.1643 0.1648
va: 2.2862 2.2935 5.4185 2.1010 1.9770 3.7143 3.6812 3.8175 3.9521 3.9242 3.9044 3.9644 3.9626 3.9155 3.9290 3.9350 3.9121 3.8721 3.8823 0.9952 0.9906 1.0024 1.0015 0.9821 1.0040 1.0075 1.0049 1.0040 0.9877 0.9885 0.9902 0.9877 0.9868 0.9870
dispcorr: -0.016536285 hartree
energy: -1830.912530213204
dipole: -3.28830 3.12313 -0.16517 7.80363 -7.13002 0.67361 -0.38453 -1.21889 -1.60341
magnitude: 1.74699 au
magnitude: 4.44050 debye
