program: Orca
programVersion: 5.0.2
elementType: S S P O O C C C C C C C C C C C C C C H H H H H H H H H H H H H H H
charge: 0
multiplicity: 1
keywords: wb97x-d3
keywords: def2-TZVPP
keywords: def2/J RIJCOSX
keywords: DEFGRID2
keywords: scfconv7
keywords: smallprint printgap noloewdin
keywords: NOSOSCF
formula: C14H15O2PS2
InChI: InChI=1/C14H15O2PS2/c1-2-16-17(15,18-13-9-5-3-6-10-13)19-14-11-7-4-8-12-14/h3-12H,2H2,1H3
34 atoms
S  0.122766 0.845683 -1.094343
S  -1.032206 -2.141647 -0.467154
P  -0.683726 -0.298405 0.459557
O  -2.133677 0.26254 0.783835
O  0.157051 -0.351791 1.678913
C  0.314904 2.375707 -0.204331
C  0.631619 -2.771643 -0.377426
C  -3.165799 0.529208 -0.191454
C  -0.624783 3.384859 -0.384276
C  1.040347 -3.459701 0.759624
C  1.412518 2.565997 0.627564
C  1.488313 -2.612816 -1.460444
C  -4.031473 1.646902 0.325402
C  -0.46115 4.593793 0.275863
C  2.322956 -3.985271 0.811427
C  1.561937 3.774862 1.289731
C  2.770973 -3.138548 -1.396503
C  0.628897 4.788236 1.113287
C  3.188736 -3.821539 -0.262306
H  -2.715873 0.79918 -1.149022
H  -3.745153 -0.384227 -0.331512
H  -1.475626 3.229815 -1.035233
H  0.363903 -3.589168 1.593855
H  2.147227 1.782116 0.752879
H  1.160016 -2.085632 -2.346409
H  -3.460611 2.565774 0.458087
H  -4.822687 1.84402 -0.396934
H  -4.501428 1.384812 1.273073
H  -1.188573 5.381925 0.134951
H  2.645516 -4.5220 1.693565
H  2.412954 3.926511 1.939818
H  3.441962 -3.014408 -2.235782
H  0.753465 5.731861 1.626789
H  4.189014 -4.231826 -0.216892
elementType: S P O C H
totalener: -1830.89578641 hartree
nucrepener: 1864.50970940 hartree
electener: -3695.40549581 hartree
oneelecener: -6224.74713282 hartree
twoeener: 2529.34163701 hartree
cpcmener: -0.03549340 hartree
kineticenergy: 1825.74160835 hartree
xcener: -123.395557969249 hartree
chargesum: -0.0000000
charge: -0.160869 -0.162684 0.702859 -0.344865 -0.627771 0.118369 0.108121 0.001752 -0.150720 -0.152830 -0.152000 -0.130893 -0.239577 -0.164839 -0.156448 -0.160682 -0.167521 -0.130163 -0.128699 0.114999 0.127013 0.159733 0.146102 0.146434 0.148787 0.085534 0.093705 0.094614 0.162968 0.163769 0.163427 0.163666 0.164140 0.164569
qa: -0.1609 -0.1627 0.7029 -0.3449 -0.6278 0.1184 0.1081 0.0018 -0.1507 -0.1528 -0.1520 -0.1309 -0.2396 -0.1648 -0.1564 -0.1607 -0.1675 -0.1302 -0.1287 0.1150 0.1270 0.1597 0.1461 0.1464 0.1488 0.0855 0.0937 0.0946 0.1630 0.1638 0.1634 0.1637 0.1641 0.1646
va: 2.2907 2.2903 5.4197 2.0969 1.9762 3.6981 3.6856 3.8109 3.9164 3.9674 3.9555 3.9256 3.9553 3.9241 3.9138 3.9152 3.9327 3.8850 3.8806 0.9975 0.9931 0.9878 1.0036 1.0054 1.0007 1.0073 1.0050 1.0043 0.9894 0.9877 0.9881 0.9885 0.9871 0.9870
dispcorr: -0.016740703 hartree
energy: -1830.912527113212
dipole: -3.81602 3.27306 -0.54296 8.44276 -7.63409 0.80867 0.62534 -2.11646 -1.49112
magnitude: 1.78107 au
magnitude: 4.52711 debye
