program: Orca
programVersion: 5.0.2
elementType: S S P O O C C C C C C C C C C C C C C H H H H H H H H H H H H H H H
charge: 0
multiplicity: 1
keywords: wb97x-d3
keywords: def2-TZVPP
keywords: def2/J RIJCOSX
keywords: DEFGRID2
keywords: scfconv7
keywords: smallprint printgap noloewdin
keywords: NOSOSCF
formula: C14H15O2PS2
InChI: InChI=1/C14H15O2PS2/c1-2-16-17(15,18-13-9-5-3-6-10-13)19-14-11-7-4-8-12-14/h3-12H,2H2,1H3
34 atoms
S  -0.833096 1.353913 -0.759439
S  -1.197533 -1.967344 -0.098511
P  -1.449583 -0.042621 0.685236
O  -3.03218 0.082113 0.736971
O  -0.806886 0.172333 2.002524
C  0.695323 1.90226 -0.034569
C  0.556767 -1.900624 -0.3820
C  -3.891635 0.008993 -0.426854
C  0.68649 2.770646 1.051708
C  1.443009 -1.928898 0.690022
C  1.893447 1.496163 -0.608255
C  1.026128 -1.875785 -1.690114
C  -4.794377 -1.192109 -0.322621
C  1.891091 3.21584 1.574918
C  2.807671 -1.912864 0.444708
C  3.093382 1.952941 -0.08219
C  2.394121 -1.880204 -1.924695
C  3.093533 2.807578 1.011173
C  3.284216 -1.890867 -0.859652
H  -4.462906 0.936288 -0.443395
H  -3.302137 -0.032157 -1.34722
H  -0.248979 3.098391 1.484456
H  1.074548 -1.97109 1.70588
H  1.890935 0.822585 -1.454329
H  0.330947 -1.852796 -2.51873
H  -5.482907 -1.190785 -1.167919
H  -4.234467 -2.127628 -0.352107
H  -5.386674 -1.167665 0.592053
H  1.889284 3.886082 2.424124
H  3.499172 -1.925586 1.276442
H  4.026755 1.633571 -0.526238
H  2.761799 -1.864159 -2.941887
H  4.030194 3.158484 1.423459
H  4.34999 -1.885563 -1.045165
elementType: S P O C H
totalener: -1830.89287370 hartree
nucrepener: 1918.91018418 hartree
electener: -3749.80305789 hartree
oneelecener: -6333.44062842 hartree
twoeener: 2583.63757054 hartree
cpcmener: -0.03279755 hartree
kineticenergy: 1825.74398962 hartree
xcener: -123.398395878000 hartree
chargesum: -0.0000000
charge: -0.164115 -0.150858 0.726015 -0.359843 -0.621521 0.085091 0.068985 0.014690 -0.137458 -0.099643 -0.128303 -0.128899 -0.223614 -0.171539 -0.173353 -0.200826 -0.156147 -0.110090 -0.131519 0.119005 0.101022 0.144864 0.142431 0.177599 0.139091 0.096375 0.076272 0.094409 0.162547 0.161142 0.161720 0.160716 0.163598 0.162156
qa: -0.1641 -0.1509 0.7260 -0.3598 -0.6215 0.0851 0.0690 0.0147 -0.1375 -0.0996 -0.1283 -0.1289 -0.2236 -0.1715 -0.1734 -0.2008 -0.1561 -0.1101 -0.1315 0.1190 0.1010 0.1449 0.1424 0.1776 0.1391 0.0964 0.0763 0.0944 0.1625 0.1611 0.1617 0.1607 0.1636 0.1622
va: 2.2964 2.3199 5.3822 2.1001 1.9747 3.7271 3.6641 3.8526 3.9082 3.8520 3.8188 3.8854 3.9366 3.9215 3.8842 3.9349 3.8766 3.8698 3.8332 0.9982 0.9926 1.0038 1.0121 0.9858 1.0111 1.0075 1.0095 1.0036 0.9881 0.9897 0.9924 0.9889 0.9864 0.9890
dispcorr: -0.019183011 hartree
energy: -1830.912056715430
dipole: 2.00318 -1.37441 0.62876 -0.45586 0.42220 -0.03366 -3.93316 1.86314 -2.07002
magnitude: 2.16367 au
magnitude: 5.49961 debye
