program: Orca
programVersion: 5.0.2
elementType: S S P O O C C C C C C C C C C C C C C H H H H H H H H H H H H H H H
charge: 0
multiplicity: 1
keywords: wb97x-d3
keywords: def2-TZVPP
keywords: def2/J RIJCOSX
keywords: DEFGRID2
keywords: scfconv7
keywords: smallprint printgap noloewdin
keywords: NOSOSCF
formula: C14H15O2PS2
InChI: InChI=1/C14H15O2PS2/c1-2-16-17(15,18-13-9-5-3-6-10-13)19-14-11-7-4-8-12-14/h3-12H,2H2,1H3
34 atoms
S  -1.24245 2.154415 0.05718
S  -0.644623 -0.909585 -1.33305
P  -1.561885 0.101688 0.255588
O  -3.089887 0.091167 -0.186755
O  -1.205246 -0.457008 1.584421
C  0.533504 2.120431 0.185588
C  0.842192 -1.522333 -0.577999
C  -3.892114 -1.110433 -0.037853
C  1.288237 2.443014 -0.936213
C  2.061624 -1.017628 -1.013061
C  1.153567 1.811959 1.392594
C  0.794766 -2.541136 0.368457
C  -4.664428 -1.085386 1.255308
C  2.673214 2.452861 -0.848288
C  3.240255 -1.518009 -0.478517
C  2.538295 1.799363 1.462481
C  1.977736 -3.026451 0.904822
C  3.298469 2.120551 0.345281
C  3.199636 -2.514914 0.485926
H  -4.558047 -1.117134 -0.898586
H  -3.258689 -1.997915 -0.104868
H  0.800739 2.680529 -1.872474
H  2.093129 -0.234857 -1.758415
H  0.565273 1.585441 2.270996
H  -0.15368 -2.95576 0.681035
H  -5.301993 -0.204225 1.321532
H  -5.305916 -1.965831 1.300838
H  -4.003237 -1.107357 2.120875
H  3.261946 2.704849 -1.720168
H  4.189056 -1.119894 -0.812746
H  3.02296 1.545575 2.395783
H  1.943677 -3.812314 1.647702
H  4.378596 2.114689 0.406931
H  4.119704 -2.89844 0.90644
elementType: S P O C H
totalener: -1830.89495595 hartree
nucrepener: 1920.90490668 hartree
electener: -3751.79986263 hartree
oneelecener: -6337.65614379 hartree
twoeener: 2585.85628116 hartree
cpcmener: -0.02909857 hartree
kineticenergy: 1825.74852367 hartree
xcener: -123.398169488335 hartree
chargesum: 0.0000000
charge: -0.117930 -0.142232 0.726816 -0.367731 -0.620690 0.064380 0.071218 0.054441 -0.137263 -0.115879 -0.130074 -0.132074 -0.243373 -0.152640 -0.194114 -0.155505 -0.173771 -0.143016 -0.115319 0.113095 0.088756 0.140676 0.156816 0.141775 0.147255 0.089797 0.096824 0.079560 0.161073 0.159249 0.162065 0.162771 0.162453 0.162591
qa: -0.1179 -0.1422 0.7268 -0.3677 -0.6207 0.0644 0.0712 0.0544 -0.1373 -0.1159 -0.1301 -0.1321 -0.2434 -0.1526 -0.1941 -0.1555 -0.1738 -0.1430 -0.1153 0.1131 0.0888 0.1407 0.1568 0.1418 0.1473 0.0898 0.0968 0.0796 0.1611 0.1592 0.1621 0.1628 0.1625 0.1626
va: 2.3266 2.3193 5.3658 2.1079 1.9574 3.6641 3.7097 3.8521 3.8933 3.8423 3.8787 3.9002 3.9446 3.8623 3.9318 3.8672 3.9266 3.8362 3.8707 0.9903 1.0032 1.0103 0.9961 1.0155 1.0018 1.0040 1.0067 1.0179 0.9883 0.9926 0.9888 0.9885 0.9883 0.9868
dispcorr: -0.019574893 hartree
energy: -1830.914530846370
dipole: 2.86091 -1.88358 0.97733 -6.97418 6.41996 -0.55422 4.27254 -5.08256 -0.81001
magnitude: 1.38509 au
magnitude: 3.52061 debye
