program: Orca
programVersion: 5.0.2
elementType: S S P O O C C C C C C C C C C C C C C H H H H H H H H H H H H H H H
charge: 0
multiplicity: 1
keywords: wb97x-d3
keywords: def2-TZVPP
keywords: def2/J RIJCOSX
keywords: DEFGRID2
keywords: scfconv7
keywords: smallprint printgap noloewdin
keywords: NOSOSCF
formula: C14H15O2PS2
InChI: InChI=1/C14H15O2PS2/c1-2-16-17(15,18-13-9-5-3-6-10-13)19-14-11-7-4-8-12-14/h3-12H,2H2,1H3
34 atoms
S  -0.878309 1.510942 -0.561576
S  -1.199932 -1.885647 -0.339712
P  -1.527548 -0.074537 0.657864
O  -3.112025 0.022931 0.637828
O  -0.967013 -0.021283 2.028822
C  0.686347 1.881593 0.19848
C  0.566549 -1.795489 -0.524407
C  -3.930208 0.098356 -0.555087
C  0.736734 2.532908 1.4265
C  1.10072 -1.663103 -1.800957
C  1.85334 1.571646 -0.488283
C  1.398175 -1.918861 0.584349
C  -4.730993 -1.166912 -0.71967
C  1.969358 2.846526 1.979048
C  2.478852 -1.656617 -1.966829
C  3.081726 1.896449 0.069393
C  2.773232 -1.88975 0.409506
C  3.141056 2.526261 1.304753
C  3.31445 -1.762082 -0.863591
H  -4.579083 0.961071 -0.416024
H  -3.31685 0.285434 -1.440521
H  -0.174577 2.796668 1.945341
H  0.448394 -1.565616 -2.658608
H  1.805513 1.072621 -1.446398
H  0.980143 -2.043367 1.57375
H  -4.099793 -2.02804 -0.939207
H  -5.320245 -1.383035 0.170909
H  -5.420301 -1.040934 -1.55446
H  2.013042 3.346435 2.937484
H  2.897117 -1.558013 -2.959622
H  3.991143 1.648189 -0.461523
H  3.422769 -1.975651 1.270322
H  4.100054 2.773085 1.740855
H  4.388352 -1.748643 -0.995018
elementType: S P O C H
totalener: -1830.89263183 hartree
nucrepener: 1921.52370464 hartree
electener: -3752.41633648 hartree
oneelecener: -6338.64962542 hartree
twoeener: 2586.23328894 hartree
cpcmener: -0.03280057 hartree
kineticenergy: 1825.73626290 hartree
xcener: -123.397736076062 hartree
chargesum: 0.0000000
charge: -0.162723 -0.149905 0.728873 -0.359848 -0.621555 0.089290 0.072037 0.015226 -0.142189 -0.133651 -0.125345 -0.105208 -0.228562 -0.168144 -0.154709 -0.196659 -0.169181 -0.113941 -0.134318 0.118666 0.104491 0.144145 0.139584 0.168121 0.141689 0.078489 0.093690 0.098384 0.162808 0.160999 0.161891 0.160833 0.164532 0.162190
qa: -0.1627 -0.1499 0.7289 -0.3598 -0.6216 0.0893 0.0720 0.0152 -0.1422 -0.1337 -0.1253 -0.1052 -0.2286 -0.1681 -0.1547 -0.1967 -0.1692 -0.1139 -0.1343 0.1187 0.1045 0.1441 0.1396 0.1681 0.1417 0.0785 0.0937 0.0984 0.1628 0.1610 0.1619 0.1608 0.1645 0.1622
va: 2.2981 2.3229 5.3797 2.1070 1.9733 3.7182 3.6632 3.8542 3.9155 3.8839 3.8275 3.8500 3.9305 3.9242 3.8740 3.9252 3.8773 3.8706 3.8304 0.9977 0.9920 1.0068 1.0107 0.9916 1.0130 1.0107 1.0041 1.0071 0.9883 0.9886 0.9918 0.9899 0.9861 0.9886
dispcorr: -0.019415687 hartree
energy: -1830.912047518924
dipole: 2.62624 -1.84272 0.78352 -0.49240 0.66380 0.17140 -4.38200 2.27455 -2.10745
magnitude: 2.25491 au
magnitude: 5.73153 debye
