program: Orca
programVersion: 5.0.2
elementType: S S P O O C C C C C C C C C C C C C C H H H H H H H H H H H H H H H
charge: 0
multiplicity: 1
keywords: wb97x-d3
keywords: def2-TZVPP
keywords: def2/J RIJCOSX
keywords: DEFGRID2
keywords: scfconv7
keywords: smallprint printgap noloewdin
keywords: NOSOSCF
formula: C14H15O2PS2
InChI: InChI=1/C14H15O2PS2/c1-2-16-17(15,18-13-9-5-3-6-10-13)19-14-11-7-4-8-12-14/h3-12H,2H2,1H3
34 atoms
S  -1.19112 1.987664 -0.117631
S  -0.721689 -1.21605 -1.286564
P  -1.626119 -0.030761 0.184013
O  -3.124925 0.017999 -0.347428
O  -1.37739 -0.523694 1.562435
C  0.571655 1.950012 0.132535
C  0.856729 -1.582828 -0.552278
C  -4.075467 -1.022107 0.004733
C  1.391725 2.336596 -0.921125
C  1.996878 -1.073672 -1.163298
C  1.116886 1.610212 1.366929
C  0.959097 -2.416234 0.556341
C  -4.811855 -0.675512 1.272811
C  2.76634 2.382841 -0.737072
C  3.246804 -1.385873 -0.6494
C  2.493553 1.631526 1.530508
C  2.213212 -2.708482 1.072364
C  3.318463 2.022338 0.483839
C  3.355658 -2.193975 0.473664
H  -4.754229 -1.080179 -0.843586
H  -3.567513 -1.985054 0.08854
H  0.96197 2.597884 -1.879153
H  1.909671 -0.433893 -2.030923
H  0.479121 1.336598 2.195731
H  0.074299 -2.83923 1.011021
H  -4.143444 -0.637451 2.13216
H  -5.325169 0.281827 1.185032
H  -5.563056 -1.441205 1.467043
H  3.404579 2.690068 -1.554689
H  4.133586 -0.987512 -1.123982
H  2.920503 1.355497 2.485378
H  2.296612 -3.347854 1.941041
H  4.391121 2.048227 0.622222
H  4.331075 -2.428335 0.878791
elementType: S P O C H
totalener: -1830.89435223 hartree
nucrepener: 1923.31330638 hartree
electener: -3754.20765861 hartree
oneelecener: -6342.47682786 hartree
twoeener: 2588.26916925 hartree
cpcmener: -0.02798842 hartree
kineticenergy: 1825.74453189 hartree
xcener: -123.397757958020 hartree
chargesum: -0.0000000
charge: -0.113904 -0.139599 0.729019 -0.371574 -0.618098 0.064471 0.055228 0.049858 -0.137306 -0.089589 -0.136308 -0.122373 -0.244388 -0.145362 -0.207571 -0.164218 -0.173733 -0.140372 -0.112191 0.111656 0.094803 0.140758 0.148205 0.143988 0.142060 0.080329 0.089417 0.097404 0.160514 0.159081 0.161563 0.162693 0.162784 0.162754
qa: -0.1139 -0.1396 0.7290 -0.3716 -0.6181 0.0645 0.0552 0.0499 -0.1373 -0.0896 -0.1363 -0.1224 -0.2444 -0.1454 -0.2076 -0.1642 -0.1737 -0.1404 -0.1122 0.1117 0.0948 0.1408 0.1482 0.1440 0.1421 0.0803 0.0894 0.0974 0.1605 0.1591 0.1616 0.1627 0.1628 0.1628
va: 2.3401 2.3273 5.3597 2.1063 1.9612 3.6794 3.7048 3.8520 3.8823 3.8254 3.8478 3.8971 3.9380 3.8785 3.9185 3.8590 3.9297 3.8343 3.8466 0.9907 1.0022 1.0099 1.0016 1.0167 1.0105 1.0198 1.0038 1.0069 0.9886 0.9928 0.9899 0.9885 0.9883 0.9873
dispcorr: -0.019951430 hartree
energy: -1830.914303660404
dipole: 2.77633 -1.74464 1.03168 -4.45618 4.11650 -0.33968 5.16300 -5.81919 -0.65618
magnitude: 1.26898 au
magnitude: 3.22550 debye
