program: Orca
programVersion: 5.0.2
elementType: S S P O O C C C C C C C C C C C C C C H H H H H H H H H H H H H H H
charge: 0
multiplicity: 1
keywords: wb97x-d3
keywords: def2-TZVPP
keywords: def2/J RIJCOSX
keywords: DEFGRID2
keywords: scfconv7
keywords: smallprint printgap noloewdin
keywords: NOSOSCF
formula: C14H15O2PS2
InChI: InChI=1/C14H15O2PS2/c1-2-16-17(15,18-13-9-5-3-6-10-13)19-14-11-7-4-8-12-14/h3-12H,2H2,1H3
34 atoms
S  -0.890632 1.521792 -0.515788
S  -1.192785 -1.887557 -0.36268
P  -1.532535 -0.095645 0.665063
O  -3.117728 -0.001514 0.630121
O  -0.982808 -0.070773 2.040729
C  0.695943 1.855959 0.215253
C  0.573871 -1.778451 -0.53955
C  -3.906374 0.076502 -0.582876
C  0.786321 2.435088 1.476791
C  1.111449 -1.621078 -1.811828
C  1.83945 1.59708 -0.529779
C  1.402804 -1.914385 0.570008
C  -4.740155 -1.167099 -0.742042
C  2.036377 2.720889 2.004634
C  2.490071 -1.598859 -1.972146
C  3.085098 1.896661 0.003053
C  2.778084 -1.869033 0.401037
C  3.185051 2.449226 1.272204
C  3.32252 -1.713961 -0.867628
H  -4.531491 0.961576 -0.479023
H  -3.266569 0.225621 -1.456611
H  -0.106586 2.664225 2.041703
H  0.461233 -1.516637 -2.670223
H  1.760115 1.158022 -1.51462
H  0.982434 -2.062219 1.55526
H  -5.385667 -1.328141 0.120522
H  -5.375774 -1.053806 -1.620029
H  -4.126718 -2.055576 -0.890993
H  2.111275 3.162387 2.98943
H  2.91115 -1.478862 -2.961431
H  3.976199 1.68915 -0.574235
H  3.425205 -1.964081 1.262657
H  4.157645 2.673933 1.689487
H  4.396647 -1.685466 -0.994344
elementType: S P O C H
totalener: -1830.89262140 hartree
nucrepener: 1923.91859708 hartree
electener: -3754.81121848 hartree
oneelecener: -6343.41289186 hartree
twoeener: 2588.60167338 hartree
cpcmener: -0.03260275 hartree
kineticenergy: 1825.74103319 hartree
xcener: -123.398671651387 hartree
chargesum: -0.0000000
charge: -0.160303 -0.149386 0.728761 -0.361161 -0.620525 0.084459 0.080720 0.014838 -0.140488 -0.139275 -0.116179 -0.113117 -0.226993 -0.169083 -0.151296 -0.196841 -0.165954 -0.113919 -0.136509 0.119494 0.103141 0.143404 0.140116 0.162778 0.141702 0.094413 0.097256 0.077957 0.162895 0.160986 0.160739 0.160865 0.164245 0.162259
qa: -0.1603 -0.1494 0.7288 -0.3612 -0.6205 0.0845 0.0807 0.0148 -0.1405 -0.1393 -0.1162 -0.1131 -0.2270 -0.1691 -0.1513 -0.1968 -0.1660 -0.1139 -0.1365 0.1195 0.1031 0.1434 0.1401 0.1628 0.1417 0.0944 0.0973 0.0780 0.1629 0.1610 0.1607 0.1609 0.1642 0.1623
va: 2.3004 2.3217 5.3803 2.1018 1.9756 3.7199 3.6586 3.8489 3.9151 3.8840 3.8260 3.8587 3.9334 3.9260 3.8685 3.9264 3.8723 3.8688 3.8310 0.9982 0.9936 1.0087 1.0103 0.9940 1.0133 1.0037 1.0071 1.0102 0.9883 0.9885 0.9922 0.9899 0.9862 0.9885
dispcorr: -0.019535726 hartree
energy: -1830.912157128769
dipole: 2.77304 -1.94033 0.83271 -0.47623 0.67498 0.19875 -4.59443 2.44901 -2.14542
magnitude: 2.30992 au
magnitude: 5.87136 debye
