program: Orca
programVersion: 5.0.2
elementType: S S P O O C C C C C C C C C C C C C C H H H H H H H H H H H H H H H
charge: 0
multiplicity: 1
keywords: wb97x-d3
keywords: def2-TZVPP
keywords: def2/J RIJCOSX
keywords: DEFGRID2
keywords: scfconv7
keywords: smallprint printgap noloewdin
keywords: NOSOSCF
formula: C14H15O2PS2
InChI: InChI=1/C14H15O2PS2/c1-2-16-17(15,18-13-9-5-3-6-10-13)19-14-11-7-4-8-12-14/h3-12H,2H2,1H3
34 atoms
S  -1.361484 1.855268 -0.149228
S  -0.415606 -1.101987 -1.527704
P  -1.537138 -0.225655 0.014061
O  -3.016813 -0.410852 -0.548179
O  -1.229197 -0.76494 1.359035
C  0.38834 2.018409 0.124601
C  0.98864 -1.69431 -0.609891
C  -4.11898 -0.773444 0.318919
C  1.182276 2.481583 -0.919324
C  0.885567 -2.854151 0.149754
C  0.947969 1.741753 1.367793
C  2.202443 -1.027626 -0.722485
C  -4.637199 0.413314 1.091716
C  2.541843 2.669257 -0.715805
C  2.003072 -3.333275 0.81593
C  2.311675 1.908417 1.553105
C  3.316572 -1.517944 -0.057283
C  3.10874 2.375462 0.516045
C  3.216932 -2.666264 0.715313
H  -4.879334 -1.167296 -0.351815
H  -3.812643 -1.579304 0.987336
H  0.742371 2.696194 -1.884449
H  -0.056005 -3.382192 0.21857
H  0.32754 1.401784 2.185864
H  2.276622 -0.129259 -1.32031
H  -4.953335 1.217633 0.427127
H  -5.503476 0.104028 1.677743
H  -3.894599 0.805624 1.788011
H  3.157917 3.037484 -1.525786
H  1.925108 -4.233125 1.41137
H  2.750204 1.680911 2.515463
H  4.261023 -0.996439 -0.141334
H  4.170516 2.515424 0.670385
H  4.086332 -3.045127 1.236291
elementType: S P O C H
totalener: -1830.90388817 hartree
nucrepener: 1913.07984666 hartree
electener: -3743.98373483 hartree
oneelecener: -6321.88532571 hartree
twoeener: 2577.90159088 hartree
cpcmener: -0.02342891 hartree
kineticenergy: 1825.74138940 hartree
xcener: -123.394180750867 hartree
chargesum: 0.0000000
charge: -0.133720 -0.141810 0.716399 -0.370153 -0.593589 0.060229 0.058661 0.044671 -0.123326 -0.118578 -0.099356 -0.119961 -0.257374 -0.163871 -0.172644 -0.167792 -0.196154 -0.132659 -0.107907 0.105699 0.099708 0.136725 0.138894 0.140133 0.168750 0.092701 0.100519 0.086108 0.157300 0.158441 0.158283 0.156852 0.158623 0.160197
qa: -0.1337 -0.1418 0.7164 -0.3702 -0.5936 0.0602 0.0587 0.0447 -0.1233 -0.1186 -0.0994 -0.1200 -0.2574 -0.1639 -0.1726 -0.1678 -0.1962 -0.1327 -0.1079 0.1057 0.0997 0.1367 0.1389 0.1401 0.1688 0.0927 0.1005 0.0861 0.1573 0.1584 0.1583 0.1569 0.1586 0.1602
va: 2.3213 2.3112 5.3544 2.1094 1.9932 3.6823 3.7376 3.8646 3.8971 3.9148 3.8428 3.8234 3.9033 3.8932 3.9305 3.8834 3.9355 3.8409 3.8728 0.9901 1.0035 1.0126 1.0046 1.0143 0.9891 1.0026 1.0109 1.0155 0.9899 0.9895 0.9906 0.9939 0.9898 0.9875
dispcorr: -0.019215354 hartree
energy: -1830.923103526730
dipole: 1.91067 -1.22620 0.68448 -0.59733 0.70276 0.10543 6.98048 -7.03411 -0.05363
magnitude: 0.69462 au
magnitude: 1.76559 debye
