program: Orca
programVersion: 5.0.2
elementType: S S P O O C C C C C C C C C C C C C C H H H H H H H H H H H H H H H
charge: 0
multiplicity: 1
keywords: wb97x-d3
keywords: def2-TZVPP
keywords: def2/J RIJCOSX
keywords: DEFGRID2
keywords: scfconv7
keywords: smallprint printgap noloewdin
keywords: NOSOSCF
formula: C14H15O2PS2
InChI: InChI=1/C14H15O2PS2/c1-2-16-17(15,18-13-9-5-3-6-10-13)19-14-11-7-4-8-12-14/h3-12H,2H2,1H3
34 atoms
S  -0.253524 0.859386 -1.172474
S  -0.293652 -1.135059 1.59751
P  -1.449924 0.071935 0.347369
O  -2.349593 -0.907659 -0.534403
O  -2.165102 1.042443 1.210549
C  0.774301 1.951402 -0.218163
C  0.730152 -2.04274 0.464841
C  -3.764124 -0.669697 -0.733946
C  2.13158 1.671121 -0.109996
C  0.190429 -2.987026 -0.401674
C  0.241819 3.103108 0.351829
C  2.104008 -1.832462 0.510927
C  -4.01306 0.406912 -1.759354
C  2.956721 2.542097 0.586702
C  1.029893 -3.690981 -1.252197
C  1.072612 3.960776 1.056817
C  2.937009 -2.555433 -0.33056
C  2.427644 3.681954 1.175789
C  2.401296 -3.47608 -1.22027
H  -4.15885 -1.62762 -1.067615
H  -4.235936 -0.428877 0.219439
H  2.542162 0.781216 -0.568344
H  -0.873747 -3.177913 -0.414956
H  -0.8087 3.334893 0.24134
H  2.52225 -1.109176 1.198574
H  -3.534369 0.173186 -2.710417
H  -5.086572 0.484684 -1.936258
H  -3.664506 1.383437 -1.421878
H  4.013764 2.325618 0.669747
H  0.608685 -4.414047 -1.938046
H  0.659525 4.854064 1.506623
H  4.006074 -2.3918 -0.292749
H  3.072339 4.357607 1.722643
H  3.051846 -4.029609 -1.884822
elementType: S P O C H
totalener: -1830.90555478 hartree
nucrepener: 1895.61977312 hartree
electener: -3726.52532790 hartree
oneelecener: -6286.58311708 hartree
twoeener: 2560.05778918 hartree
cpcmener: -0.02464257 hartree
kineticenergy: 1825.73584586 hartree
xcener: -123.394567034555 hartree
chargesum: 0.0000000
charge: -0.137956 -0.123934 0.706682 -0.349349 -0.614097 0.061699 0.014326 0.041703 -0.117167 -0.096836 -0.105813 -0.111021 -0.253624 -0.185604 -0.181078 -0.180793 -0.174391 -0.111097 -0.115231 0.104037 0.099148 0.157079 0.147942 0.142054 0.150605 0.091050 0.100639 0.086967 0.157028 0.159259 0.158802 0.158725 0.159891 0.160354
qa: -0.1380 -0.1239 0.7067 -0.3493 -0.6141 0.0617 0.0143 0.0417 -0.1172 -0.0968 -0.1058 -0.1110 -0.2536 -0.1856 -0.1811 -0.1808 -0.1744 -0.1111 -0.1152 0.1040 0.0991 0.1571 0.1479 0.1421 0.1506 0.0910 0.1006 0.0870 0.1570 0.1593 0.1588 0.1587 0.1599 0.1604
va: 2.3151 2.3418 5.3704 2.0934 1.9912 3.7012 3.7344 3.8583 3.8836 3.8808 3.9135 3.8468 3.9060 3.9563 3.9353 3.9420 3.9423 3.8703 3.8747 0.9906 1.0049 0.9889 1.0053 1.0103 0.9985 1.0036 1.0109 1.0145 0.9917 0.9902 0.9904 0.9903 0.9879 0.9879
dispcorr: -0.018010470 hartree
energy: -1830.923565247555
dipole: -0.44786 1.45036 1.00250 0.56413 -1.27026 -0.70613 -6.82669 5.58096 -1.24573
magnitude: 1.74799 au
magnitude: 4.44303 debye
