program: Orca
programVersion: 5.0.2
elementType: S S P O O C C C C C C C C C C C C C C H H H H H H H H H H H H H H H
charge: 0
multiplicity: 1
keywords: wb97x-d3
keywords: def2-TZVPP
keywords: def2/J RIJCOSX
keywords: DEFGRID2
keywords: scfconv7
keywords: smallprint printgap noloewdin
keywords: NOSOSCF
formula: C14H15O2PS2
InChI: InChI=1/C14H15O2PS2/c1-2-16-17(15,18-13-9-5-3-6-10-13)19-14-11-7-4-8-12-14/h3-12H,2H2,1H3
34 atoms
S  -0.894052 1.815074 -0.577316
S  -1.073927 -1.603534 -0.946105
P  -1.646023 0.035622 0.229883
O  -3.162545 0.185506 -0.234327
O  -1.371042 -0.139071 1.675519
C  0.715587 1.863796 0.182611
C  0.687307 -1.627745 -0.688782
C  -4.259674 -0.259571 0.6010
C  0.849911 2.12828 1.541288
C  1.506619 -1.544823 -1.809789
C  1.838338 1.710898 -0.622615
C  1.239987 -1.795418 0.577411
C  -4.436559 -1.756278 0.55472
C  2.118286 2.204883 2.096757
C  2.8835 -1.626981 -1.661611
C  3.102472 1.805752 -0.060078
C  2.618435 -1.844705 0.716956
C  3.243615 2.043867 1.299886
C  3.441247 -1.765888 -0.399058
H  -4.108724 0.091442 1.622634
H  -5.132827 0.249714 0.199157
H  -0.022902 2.277857 2.161414
H  1.07347 -1.413558 -2.792999
H  1.726436 1.513994 -1.68031
H  0.606115 -1.887539 1.448325
H  -5.313741 -2.026122 1.144558
H  -4.59782 -2.111268 -0.463635
H  -3.583028 -2.286413 0.980073
H  2.225732 2.399633 3.155685
H  3.51931 -1.5683 -2.535437
H  3.975952 1.685125 -0.687071
H  3.049417 -1.959005 1.702841
H  4.230746 2.10983 1.738118
H  4.516013 -1.815735 -0.283319
elementType: S P O C H
totalener: -1830.90351411 hartree
nucrepener: 1925.68134327 hartree
electener: -3756.58485738 hartree
oneelecener: -6347.03768034 hartree
twoeener: 2590.45282296 hartree
cpcmener: -0.02260816 hartree
kineticenergy: 1825.73275392 hartree
xcener: -123.394584794561 hartree
chargesum: -0.0000000
charge: -0.131084 -0.128722 0.721059 -0.370958 -0.590532 0.033320 0.078723 0.044811 -0.108313 -0.135619 -0.078847 -0.138024 -0.258938 -0.171522 -0.148215 -0.206736 -0.159657 -0.106982 -0.140046 0.101330 0.105979 0.136514 0.137882 0.144356 0.144388 0.100901 0.093671 0.086362 0.158249 0.156323 0.155681 0.157603 0.158514 0.158531
qa: -0.1311 -0.1287 0.7211 -0.3710 -0.5905 0.0333 0.0787 0.0448 -0.1083 -0.1356 -0.0788 -0.1380 -0.2589 -0.1715 -0.1482 -0.2067 -0.1597 -0.1070 -0.1400 0.1013 0.1060 0.1365 0.1379 0.1444 0.1444 0.1009 0.0937 0.0864 0.1582 0.1563 0.1557 0.1576 0.1585 0.1585
va: 2.3260 2.3320 5.3575 2.1129 1.9965 3.7219 3.6851 3.8618 3.9035 3.8830 3.8155 3.8384 3.8988 3.9339 3.8941 3.9185 3.8578 3.8448 3.8446 1.0041 0.9900 1.0145 1.0116 1.0038 1.0162 1.0114 1.0022 1.0155 0.9897 0.9897 0.9939 0.9913 0.9888 0.9896
dispcorr: -0.020103055 hartree
energy: -1830.923617163073
dipole: 3.39221 -2.56741 0.82480 -4.41156 4.25082 -0.16075 4.57879 -4.90495 -0.32615
magnitude: 0.90140 au
magnitude: 2.29117 debye
