program: Orca
programVersion: 5.0.2
elementType: S S P O O C C C C C C C C C C C C C C H H H H H H H H H H H H H H H
charge: 0
multiplicity: 1
keywords: wb97x-d3
keywords: def2-TZVPP
keywords: def2/J RIJCOSX
keywords: DEFGRID2
keywords: scfconv7
keywords: smallprint printgap noloewdin
keywords: NOSOSCF
formula: C14H15O2PS2
InChI: InChI=1/C14H15O2PS2/c1-2-16-17(15,18-13-9-5-3-6-10-13)19-14-11-7-4-8-12-14/h3-12H,2H2,1H3
34 atoms
S  -1.020216 1.187574 -0.959195
S  -0.896716 -2.1856 -0.328885
P  -1.611264 -0.342641 0.349562
O  -3.130313 -0.560488 -0.076096
O  -1.320678 -0.045792 1.772166
C  0.547676 1.684405 -0.27996
C  0.855499 -1.88815 -0.230573
C  -4.230201 -0.014816 0.691262
C  0.633133 2.297272 0.966042
C  1.479414 -1.659359 0.991717
C  1.682678 1.525047 -1.066848
C  1.60229 -1.961366 -1.40108
C  -4.428058 1.458578 0.442194
C  1.869556 2.714665 1.435586
C  2.853142 -1.474886 1.031217
C  2.911412 1.96382 -0.595819
C  2.979884 -1.804814 -1.346243
C  3.008475 2.549115 0.658606
C  3.605104 -1.55313 -0.133662
H  -5.098028 -0.585206 0.365501
H  -4.073539 -0.221101 1.750934
H  -0.253065 2.452013 1.565213
H  0.9034 -1.627275 1.906272
H  1.608778 1.059021 -2.040266
H  1.112846 -2.137838 -2.350082
H  -5.31832 1.787353 0.980029
H  -3.589075 2.054442 0.802167
H  -4.580231 1.671115 -0.616153
H  1.939854 3.179998 2.410168
H  3.337622 -1.282337 1.979489
H  3.793642 1.838299 -1.209872
H  3.561733 -1.867842 -2.256556
H  3.969718 2.881438 1.028475
H  4.67833 -1.419425 -0.09431
elementType: S P O C H
totalener: -1830.90415850 hartree
nucrepener: 1927.84875454 hartree
electener: -3758.75291304 hartree
oneelecener: -6351.33160325 hartree
twoeener: 2592.57869021 hartree
cpcmener: -0.02274132 hartree
kineticenergy: 1825.73444736 hartree
xcener: -123.395254097510 hartree
chargesum: -0.0000000
charge: -0.140831 -0.117892 0.716136 -0.367283 -0.590677 0.052585 0.066266 0.043869 -0.109666 -0.131230 -0.086834 -0.139522 -0.255519 -0.173927 -0.160128 -0.206503 -0.144053 -0.108477 -0.138999 0.106598 0.101382 0.137988 0.142182 0.144911 0.136939 0.100333 0.085759 0.091742 0.158756 0.157975 0.155041 0.156335 0.157859 0.158890
qa: -0.1408 -0.1179 0.7161 -0.3673 -0.5907 0.0526 0.0663 0.0439 -0.1097 -0.1312 -0.0868 -0.1395 -0.2555 -0.1739 -0.1601 -0.2065 -0.1441 -0.1085 -0.1390 0.1066 0.1014 0.1380 0.1422 0.1449 0.1369 0.1003 0.0858 0.0917 0.1588 0.1580 0.1550 0.1563 0.1579 0.1589
va: 2.3111 2.3397 5.3694 2.1165 1.9966 3.7089 3.6839 3.8593 3.8882 3.8515 3.8237 3.8926 3.9081 3.9350 3.8626 3.9265 3.8840 3.8504 3.8396 0.9898 1.0050 1.0105 1.0164 1.0036 1.0114 1.0110 1.0096 1.0027 0.9899 0.9910 0.9941 0.9898 0.9888 0.9896
dispcorr: -0.020212238 hartree
energy: -1830.924370736938
dipole: 3.12841 -2.34121 0.78720 7.55918 -7.01064 0.54854 3.07944 -3.59512 -0.51568
magnitude: 1.08927 au
magnitude: 2.76870 debye
