program: Orca
programVersion: 5.0.2
elementType: S S P O O C C C C C C C C C C C C C C H H H H H H H H H H H H H H H
charge: 0
multiplicity: 1
keywords: wb97x-d3
keywords: def2-TZVPP
keywords: def2/J RIJCOSX
keywords: DEFGRID2
keywords: scfconv7
keywords: smallprint printgap noloewdin
keywords: NOSOSCF
formula: C14H15O2PS2
InChI: InChI=1/C14H15O2PS2/c1-2-16-17(15,18-13-9-5-3-6-10-13)19-14-11-7-4-8-12-14/h3-12H,2H2,1H3
34 atoms
S  -0.700498 0.650377 1.451437
S  -0.27977 -1.160737 -1.416738
P  -1.643343 -0.586026 0.051354
O  -2.576679 0.281844 -0.910404
O  -2.326238 -1.650526 0.825795
C  0.432985 1.650583 0.520602
C  1.076386 -1.723171 -0.413277
C  -3.990627 0.439817 -0.646651
C  1.740271 1.716102 0.99286
C  0.940216 -2.794236 0.463825
C  0.048698 2.397941 -0.587792
C  2.305761 -1.095957 -0.579452
C  -4.274546 1.276078 0.576145
C  2.664856 2.525878 0.350418
C  2.040189 -3.216019 1.1965
C  0.988486 3.182821 -1.240027
C  3.40382 -1.538826 0.143577
C  2.294267 3.252101 -0.772765
C  3.270732 -2.592176 1.037097
H  -4.378855 0.920312 -1.542883
H  -4.454083 -0.544619 -0.566733
H  2.03989 1.129646 1.85204
H  -0.00992 -3.298891 0.576882
H  -0.97001 2.374016 -0.949296
H  2.405546 -0.264825 -1.265288
H  -3.790915 2.251524 0.522241
H  -5.350906 1.441479 0.639438
H  -3.967001 0.781928 1.498218
H  3.680096 2.575109 0.722317
H  1.935542 -4.042409 1.887423
H  0.692498 3.751163 -2.112307
H  4.361233 -1.051266 0.012657
H  3.020151 3.872599 -1.282183
H  4.126551 -2.930431 1.606878
elementType: S P O C H
totalener: -1830.90395475 hartree
nucrepener: 1921.89166545 hartree
electener: -3752.79562020 hartree
oneelecener: -6338.84362021 hartree
twoeener: 2586.04800001 hartree
cpcmener: -0.02382732 hartree
kineticenergy: 1825.72188267 hartree
xcener: -123.395056640970 hartree
chargesum: 0.0000000
charge: -0.125551 -0.113905 0.696368 -0.347461 -0.608766 0.059823 0.027335 0.037866 -0.090826 -0.115360 -0.141783 -0.094130 -0.259538 -0.179591 -0.172988 -0.170749 -0.184058 -0.126349 -0.118935 0.108308 0.106028 0.137568 0.143981 0.148355 0.146643 0.093116 0.102781 0.086314 0.157544 0.160012 0.159994 0.157387 0.159881 0.160686
qa: -0.1256 -0.1139 0.6964 -0.3475 -0.6088 0.0598 0.0273 0.0379 -0.0908 -0.1154 -0.1418 -0.0941 -0.2595 -0.1796 -0.1730 -0.1707 -0.1841 -0.1263 -0.1189 0.1083 0.1060 0.1376 0.1440 0.1484 0.1466 0.0931 0.1028 0.0863 0.1575 0.1600 0.1600 0.1574 0.1599 0.1607
va: 2.3277 2.3394 5.3768 2.0921 2.0007 3.6883 3.7257 3.8364 3.8298 3.9041 3.8716 3.8293 3.9181 3.9285 3.9443 3.9378 3.9320 3.8745 3.8782 0.9920 1.0058 1.0100 1.0148 1.0068 0.9977 1.0022 1.0107 1.0110 0.9910 0.9895 0.9901 0.9927 0.9886 0.9879
dispcorr: -0.019558879 hartree
energy: -1830.923513624877
dipole: 1.05885 0.14337 1.20222 7.37406 -5.87362 1.50045 0.79706 -1.38054 -0.58347
magnitude: 2.00926 au
magnitude: 5.10713 debye
