program: Gaussian 09
title: 000065855
version: EM64L-G09RevD.01
frameworkgroup: C1[X(C10H18ClN3O6)]
method: RPBEPBE
basis: SDD
operation: Freq
keyword: #p
keyword: freq=noraman
keyword: PBEPBE/SDD
title: #p freq=noraman PBEPBE/SDD
converged: YES YES NO NO
title: Mulliken charges:
elementType: Cl O O O O O O N N N C C C C C C C C C C H H H H H H H H H H H H H H H H H H
charge: -0.037801 -0.243130 -0.447177 -0.284220 -0.427911 -0.239984 -0.227388 -0.419960 -0.185302 0.039397 -0.137567 -0.104790 -0.001934 -0.442764 -0.033411 -0.411978 0.308395 -0.505717 -0.334059 -0.569862 0.307358 0.195926 0.236147 0.237273 0.207047 0.221998 0.336266 0.234135 0.230937 0.352056 0.334946 0.232721 0.208475 0.251235 0.271084 0.275534 0.296616 0.277406
chargesum: 0.00000
title: Mulliken charges with hydrogens summed into heavy atoms:
elementType: Cl O O O O O O N N N C C C C C C C C C C
charge: -0.037801 -0.243130 -0.095121 -0.284220 -0.092964 -0.239984 -0.227388 -0.083695 -0.185302 0.039397 0.169791 0.091137 0.234214 0.001556 0.188588 0.053094 0.308395 0.186714 0.212559 0.004160
polarizability: 2.10748085e+02 -5.18037593e+00 1.40516041e+02 -1.19727680e+00 -1.34067758e+01 1.41176880e+02
1716.lowfreq: -4.0808 -0.0021 -0.0020 -0.0018 3.8322 7.6014 20.7115 24.4330 34.5997
frequency: 18.6933 24.0200 34.3921 43.4387 58.4237 60.7274 69.1191 78.2346 87.4508 121.4545 127.4862 144.0448 179.1765 185.8493 212.8658 219.9806 237.6007 255.6502 268.0209 285.1269 298.1754 320.8930 324.6471 337.9300 355.9588 369.2648 417.1472 437.0654 447.3797 462.2845 504.5184 535.8026 564.0151 585.2447 691.0431 705.7034 718.8892 724.2949 730.9063 784.1095 789.1119 829.2229 836.1133 878.9629 909.1772 919.1025 961.0272 992.9777 997.6128 1012.1593 1027.7446 1043.6104 1052.9654 1066.7536 1069.7601 1086.8152 1093.0059 1119.2508 1124.1691 1144.5828 1152.1344 1179.7687 1200.2906 1210.4690 1224.1341 1244.3590 1266.6966 1279.5493 1287.9231 1300.6158 1313.8075 1321.5581 1324.6032 1332.6114 1342.5219 1349.4081 1357.2156 1368.0170 1375.7623 1381.6430 1393.1046 1433.3363 1437.5360 1445.5533 1454.0508 1455.4894 1457.6508 1482.7188 1491.6183 1660.6901 2933.7786 2960.1520 2992.7203 2996.7136 3004.1547 3012.1657 3045.1998 3055.4514 3060.7719 3070.7009 3083.0285 3093.5575 3119.8189 3122.0453 3160.8092 3469.9516 3552.8232 3564.0426
redmass: 7.0521 7.6060 9.2615 4.5716 5.6395 5.8898 3.1169 3.6930 3.6614 7.6701 7.0170 1.7284 5.2149 1.8761 6.9887 3.0898 7.2393 2.9804 3.0986 1.8540 1.7701 2.2601 1.8583 4.0145 3.5049 4.3995 3.7936 6.1518 5.0684 7.6117 4.8911 4.4955 3.8064 4.7740 7.1835 5.5287 1.5995 2.9632 1.9516 2.5641 2.0287 4.5936 4.2142 2.6803 3.0694 2.6386 3.3713 3.6780 4.2211 3.7596 3.8539 2.2324 2.3155 2.9567 2.7562 3.3014 2.0862 1.4605 2.1526 2.2817 1.4602 1.4725 1.4193 1.7135 1.2813 2.3400 1.1685 1.3269 1.3769 1.2169 1.4168 1.2358 1.2337 1.2311 1.3109 1.2700 1.3078 1.3732 3.7119 1.4901 1.5423 1.1431 1.1142 1.0958 1.0833 1.0924 1.0492 1.0540 1.8436 10.0796 1.0827 1.0342 1.0837 1.0768 1.0632 1.0721 1.0592 1.1009 1.0858 1.0558 1.0998 1.1016 1.1048 1.1017 1.1129 1.0768 1.0658 1.0664
irintensity: 0.1988 0.1542 0.2349 1.1196 0.4228 2.7326 0.2557 2.9873 5.6628 4.2650 6.5267 7.5399 4.7172 0.8283 17.1041 37.8469 1.3673 9.1615 9.5880 100.6622 17.3002 50.8685 45.5123 8.8129 60.6209 35.1541 9.5746 19.4984 4.0424 3.6491 10.0348 11.4085 3.6869 0.9481 22.8908 32.0254 120.0500 9.6063 14.7444 9.1959 97.5605 32.6827 20.1602 34.6486 82.1467 132.9183 50.8141 111.3248 50.3280 158.2376 46.6020 26.8439 7.5441 16.7750 28.2194 60.1936 14.4538 8.6310 17.3266 14.1251 4.0005 69.7751 6.4743 8.8379 18.1215 41.3340 7.6699 13.5198 91.9378 9.3463 27.0628 20.0153 11.2689 24.7884 8.3350 12.8723 15.6504 55.1381 105.8158 21.1086 9.6584 8.3037 20.8405 12.3574 8.2933 9.6029 9.2143 11.4404 465.7639 232.2885 37.3913 67.2993 25.9493 19.9227 32.6137 55.7544 1.8653 32.2103 7.3269 12.0937 12.9470 13.9372 1.2125 18.9976 2.4358 42.1211 5.3705 9.6682
temp: 298.150 k
press: 1.00000 atm
elementType: 17 8 8 8 8 8 8 7 7 7 6 6 6 6 6 6 6 6 6 6 1 1 1 1 1 1 1 1 1 1 1 1 1 1 1 1 1 1
symmnumber: 1
zpe: 776399.6 jmol-1
zpe.correction: 0.295715 hartree
zpe.thermalcorrener: 0.318037 hartree
zpe.thermalcorrenthalpy: 0.318981 hartree
zpe.thermalcorrgfe: 0.241005 hartree
zpe.sumelectzpe: -1465.847212 hartree
zpe.sumelectthermal: -1465.824890 hartree
zpe.sumelectthermalent: -1465.823946 hartree
zpe.sumelectthermalfe: -1465.901921 hartree
dipole: -0.8227 0.5405 1.3011
dipole: 1.6315
quadrupole: -158.6986 -124.1845 -125.3893
quadrupole: -9.6889 1.6079 7.1060
quadrupole: -22.6078 11.9064 10.7015 -9.6889 1.6079 7.1060
hfenergy: -1466.142927 hartree
pointgroup: C01 [X(C10H18Cl1N3O6)]
dipole: -0.3128361 0.2102834 0.5195298 debye
polarizability: 210.8853081|-3.285698|139.7929857|-3.0958635|-13.3103052|141.7627122 unknown
InChI: InChI=1S/C10H18ClN3O6/c1-19-8-4-6(9(16)7(5-15)20-8)12-10(17)14(13-18)3-2-11/h6-9,12,15-16H,2-5H2,1H3
charge 0 multiplicity 1
38 atoms
Cl 6.442123 1.393487 -1.241858
O  -3.498744 0.126292 0.950461
O  -1.314952 -1.824484 -1.345515
O  -2.660157 2.261804 0.176384
O  -5.367056 -1.204592 -1.104671
O  1.709466 0.694312 -1.37945
O  4.191726 -1.688008 1.67937
N  0.688335 -0.467201 0.398397
N  3.04507 -0.550418 0.097504
N  3.043928 -1.296926 1.285614
C  -0.685146 0.03739 0.192438
C  -1.654169 -1.138393 -0.096163
C  -3.091368 -0.599056 -0.2756
C  -1.1711 0.84549 1.419481
C  -2.635165 1.276379 1.241718
C  -4.125019 -1.708302 -0.501577
C  1.75382 -0.047466 -0.362804
C  -3.994643 2.855354 -0.025613
C  4.275279 -0.250287 -0.670209
C  4.859819 1.112331 -0.261313
H  -0.659497 0.691345 -0.696749
H  -1.62921 -1.849261 0.761918
H  -3.081837 0.101139 -1.136614
H  -0.539583 1.739795 1.557198
H  -1.105756 0.226261 2.334889
H  -3.066782 1.688848 2.175462
H  0.9069 -1.030156 1.229181
H  -3.670682 -2.50549 -1.121198
H  -4.43246 -2.124319 0.471842
H  -0.338894 -1.997045 -1.358889
H  -5.195215 -0.999322 -2.058322
H  -3.886161 3.551012 -0.871228
H  -4.314565 3.411681 0.878576
H  -4.743321 2.075859 -0.257934
H  4.999021 -1.055459 -0.45833
H  4.014214 -0.240833 -1.739417
H  4.187829 1.941209 -0.523702
H  5.151052 1.143931 0.798321
