program: Orca
programVersion: 5.0.2
elementType: S S P O O C C C C C C C C C C C C C C H H H H H H H H H H H H H H H
charge: 0
multiplicity: 1
keywords: wb97x-d3
keywords: def2-TZVPP
keywords: def2/J RIJCOSX
keywords: DEFGRID2
keywords: scfconv7
keywords: smallprint printgap noloewdin
keywords: NOSOSCF
formula: C14H15O2PS2
InChI: InChI=1/C14H15O2PS2/c1-2-16-17(15,18-13-9-5-3-6-10-13)19-14-11-7-4-8-12-14/h3-12H,2H2,1H3
34 atoms
S  -1.34135 1.8669 0.483419
S  -0.707196 -1.023677 -1.207061
P  -1.486062 -0.222064 0.577862
O  -3.058401 -0.435081 0.481407
O  -0.889548 -0.833599 1.784506
C  0.42423 2.013348 0.334528
C  0.845713 -1.645917 -0.602199
C  -3.879119 0.022482 -0.616733
C  0.959887 2.477832 -0.861223
C  0.889443 -2.787209 0.191392
C  1.249541 1.720493 1.415567
C  2.017076 -1.004557 -0.984235
C  -4.988947 -0.972098 -0.831339
C  2.332368 2.649869 -0.973314
C  2.115647 -3.267449 0.624699
C  2.621232 1.874912 1.285598
C  3.240259 -1.499726 -0.555386
C  3.163176 2.341268 0.094857
C  3.290567 -2.625424 0.254211
H  -4.274903 1.005778 -0.357597
H  -3.285193 0.13435 -1.52805
H  0.311978 2.703837 -1.697985
H  -0.022728 -3.29654 0.471075
H  0.82796 1.379399 2.351215
H  1.975842 -0.120405 -1.605876
H  -5.627339 -0.62365 -1.643624
H  -4.597903 -1.951602 -1.106178
H  -5.608819 -1.077601 0.059128
H  2.751216 3.015883 -1.901612
H  2.15211 -4.148241 1.252469
H  3.266677 1.637474 2.121037
H  4.152516 -0.9978 -0.850216
H  4.234058 2.467473 0.001384
H  4.244908 -3.005385 0.595212
elementType: S P O C H
totalener: -1830.90330046 hartree
nucrepener: 1914.26215896 hartree
electener: -3745.16545942 hartree
oneelecener: -6323.95447322 hartree
twoeener: 2578.78901380 hartree
cpcmener: -0.02651703 hartree
kineticenergy: 1825.73176731 hartree
xcener: -123.393912038143 hartree
chargesum: 0.0000000
charge: -0.143616 -0.168573 0.708276 -0.350410 -0.589932 0.060711 0.087494 0.018075 -0.126335 -0.127014 -0.096069 -0.125689 -0.236849 -0.158973 -0.166994 -0.166097 -0.195319 -0.130635 -0.110474 0.115340 0.103273 0.136608 0.139979 0.141022 0.165129 0.090115 0.086664 0.091864 0.156674 0.158341 0.157918 0.157228 0.158710 0.159559
qa: -0.1436 -0.1686 0.7083 -0.3504 -0.5899 0.0607 0.0875 0.0181 -0.1263 -0.1270 -0.0961 -0.1257 -0.2368 -0.1590 -0.1670 -0.1661 -0.1953 -0.1306 -0.1105 0.1153 0.1033 0.1366 0.1400 0.1410 0.1651 0.0901 0.0867 0.0919 0.1567 0.1583 0.1579 0.1572 0.1587 0.1596
va: 2.3105 2.2929 5.4052 2.1107 2.0155 3.6733 3.7367 3.8534 3.8865 3.9103 3.8518 3.8359 3.9698 3.8815 3.9298 3.8847 3.9349 3.8364 3.8766 0.9885 0.9835 1.0121 1.0068 1.0126 0.9931 1.0058 1.0083 1.0040 0.9901 0.9897 0.9906 0.9933 0.9897 0.9876
dispcorr: -0.019015558 hartree
energy: -1830.922316019821
dipole: 1.91826 -1.25779 0.66046 -2.05766 2.72321 0.66555 -4.58885 2.87320 -1.71565
magnitude: 1.95515 au
magnitude: 4.96959 debye
