program: Orca
programVersion: 5.0.2
elementType: S S P O O C C C C C C C C C C C C C C H H H H H H H H H H H H H H H
charge: 0
multiplicity: 1
keywords: wb97x-d3
keywords: def2-TZVPP
keywords: def2/J RIJCOSX
keywords: DEFGRID2
keywords: scfconv7
keywords: smallprint printgap noloewdin
keywords: NOSOSCF
formula: C14H15O2PS2
InChI: InChI=1/C14H15O2PS2/c1-2-16-17(15,18-13-9-5-3-6-10-13)19-14-11-7-4-8-12-14/h3-12H,2H2,1H3
34 atoms
S  -0.596165 0.695641 1.448629
S  -0.271866 -1.2545 -1.328464
P  -1.585035 -0.622353 0.16049
O  -2.565329 0.177336 -0.812679
O  -2.216553 -1.652337 1.020115
C  0.428419 1.695609 0.39926
C  1.115291 -1.770531 -0.343426
C  -3.963402 0.373082 -0.495458
C  1.773193 1.79306 0.741384
C  2.341736 -1.164891 -0.590244
C  -0.076507 2.41542 -0.678118
C  1.003201 -2.784491 0.602382
C  -4.179302 1.349216 0.634053
C  2.614701 2.606688 -0.002261
C  3.461889 -1.572665 0.119218
C  0.779314 3.204304 -1.43225
C  2.125478 -3.169443 1.321236
C  2.122801 3.304102 -1.096162
C  3.353772 -2.567916 1.080119
H  -4.398822 0.748205 -1.419572
H  -4.422423 -0.591956 -0.276603
H  2.16409 1.231346 1.579821
H  2.421768 -0.377207 -1.327777
H  -1.125085 2.367197 -0.93636
H  0.054507 -3.272825 0.780494
H  -3.834186 0.959425 1.591795
H  -3.685469 2.302807 0.445476
H  -5.249097 1.541929 0.726357
H  3.659513 2.682847 0.269005
H  4.417474 -1.103396 -0.075545
H  0.389113 3.751308 -2.28048
H  2.039461 -3.951058 2.064806
H  2.78351 3.927759 -1.683867
H  4.227486 -2.879424 1.637469
elementType: S P O C H
totalener: -1830.90429716 hartree
nucrepener: 1920.43907237 hartree
electener: -3751.34336952 hartree
oneelecener: -6335.93616711 hartree
twoeener: 2584.59279759 hartree
cpcmener: -0.02396447 hartree
kineticenergy: 1825.73444827 hartree
xcener: -123.397197461409 hartree
chargesum: -0.0000000
charge: -0.127068 -0.115714 0.699397 -0.346719 -0.608892 0.049599 0.031727 0.036731 -0.087601 -0.097052 -0.128211 -0.118741 -0.262634 -0.184214 -0.184203 -0.179805 -0.174003 -0.116827 -0.116601 0.108198 0.107091 0.138441 0.144267 0.146828 0.145366 0.087839 0.093554 0.104554 0.157688 0.157694 0.159738 0.159679 0.159206 0.160690
qa: -0.1271 -0.1157 0.6994 -0.3467 -0.6089 0.0496 0.0317 0.0367 -0.0876 -0.0971 -0.1282 -0.1187 -0.2626 -0.1842 -0.1842 -0.1798 -0.1740 -0.1168 -0.1166 0.1082 0.1071 0.1384 0.1443 0.1468 0.1454 0.0878 0.0936 0.1046 0.1577 0.1577 0.1597 0.1597 0.1592 0.1607
va: 2.3247 2.3378 5.3785 2.0968 2.0025 3.6990 3.7225 3.8376 3.8302 3.8395 3.8634 3.9040 3.9201 3.9342 3.9332 3.9490 3.9456 3.8713 3.8757 0.9921 1.0057 1.0087 0.9994 1.0036 1.0152 1.0092 1.0012 1.0106 0.9911 0.9921 0.9904 0.9898 0.9886 0.9878
dispcorr: -0.019473495 hartree
energy: -1830.923770653156
dipole: 0.80642 0.29638 1.10280 7.80740 -6.27542 1.53197 0.19006 -0.90958 -0.71951
magnitude: 2.02010 au
magnitude: 5.13469 debye
