program: Orca
programVersion: 5.0.2
elementType: S S P O O C C C C C C C C C C C C C C H H H H H H H H H H H H H H H
charge: 0
multiplicity: 1
keywords: wb97x-d3
keywords: def2-TZVPP
keywords: def2/J RIJCOSX
keywords: DEFGRID2
keywords: scfconv7
keywords: smallprint printgap noloewdin
keywords: NOSOSCF
formula: C14H15O2PS2
InChI: InChI=1/C14H15O2PS2/c1-2-16-17(15,18-13-9-5-3-6-10-13)19-14-11-7-4-8-12-14/h3-12H,2H2,1H3
34 atoms
S  -1.329373 1.857418 0.374346
S  -0.777633 -1.226673 -1.009654
P  -1.542749 -0.207869 0.662929
O  -3.114964 -0.390643 0.520694
O  -1.015194 -0.703368 1.952969
C  0.440974 1.941683 0.227336
C  0.864465 -1.626426 -0.458311
C  -3.892336 -0.024797 -0.641321
C  1.254875 1.689956 1.327365
C  1.94112 -1.060529 -1.130348
C  0.991838 2.335654 -0.986534
C  1.071532 -2.55061 0.560385
C  -5.211038 -0.747873 -0.572594
C  2.62945 1.817061 1.199955
C  3.233901 -1.408122 -0.76696
C  2.367462 2.483313 -1.096216
C  2.368071 -2.878454 0.926525
C  3.186162 2.218743 -0.007491
C  3.449073 -2.308761 0.266416
H  -4.039602 1.056637 -0.641426
H  -3.359196 -0.291073 -1.557784
H  0.822186 1.404254 2.276358
H  1.773021 -0.35127 -1.929191
H  0.353703 2.527765 -1.839188
H  0.232927 -3.014272 1.060689
H  -5.077024 -1.82907 -0.60157
H  -5.764731 -0.486007 0.329113
H  -5.817375 -0.4615 -1.432075
H  3.265436 1.61243 2.051226
H  4.072194 -0.966002 -1.289215
H  2.798261 2.796391 -2.038351
H  2.532499 -3.58915 1.725857
H  4.259266 2.327079 -0.098117
H  4.45883 -2.572517 0.553291
elementType: S P O C H
totalener: -1830.90309205 hartree
nucrepener: 1917.27073834 hartree
electener: -3748.17383039 hartree
oneelecener: -6329.89193897 hartree
twoeener: 2581.71810858 hartree
cpcmener: -0.02605628 hartree
kineticenergy: 1825.73021716 hartree
xcener: -123.394636275171 hartree
chargesum: -0.0000000
charge: -0.145856 -0.165923 0.715626 -0.350277 -0.589258 0.084099 0.072345 0.022863 -0.119893 -0.104041 -0.146064 -0.120027 -0.241425 -0.156052 -0.194280 -0.144110 -0.167444 -0.140774 -0.111400 0.109075 0.108794 0.142228 0.150476 0.138070 0.137684 0.089941 0.091102 0.089517 0.157595 0.154567 0.156920 0.158448 0.158373 0.159101
qa: -0.1459 -0.1659 0.7156 -0.3503 -0.5893 0.0841 0.0723 0.0229 -0.1199 -0.1040 -0.1461 -0.1200 -0.2414 -0.1561 -0.1943 -0.1441 -0.1674 -0.1408 -0.1114 0.1091 0.1088 0.1422 0.1505 0.1381 0.1377 0.0899 0.0911 0.0895 0.1576 0.1546 0.1569 0.1584 0.1584 0.1591
va: 2.3105 2.3051 5.4022 2.1249 2.0190 3.6682 3.7365 3.8604 3.8664 3.8268 3.8894 3.9153 3.9713 3.8684 3.9307 3.8704 3.9331 3.8423 3.8712 0.9896 0.9817 1.0140 1.0003 1.0113 1.0129 1.0062 1.0045 1.0051 0.9907 0.9944 0.9896 0.9899 0.9897 0.9880
dispcorr: -0.019266846 hartree
energy: -1830.922358896210
dipole: 2.04326 -1.23536 0.80790 -1.27479 1.85653 0.58174 -4.70689 2.81472 -1.89217
magnitude: 2.13809 au
magnitude: 5.43460 debye
