program: Orca
programVersion: 5.0.2
elementType: S S P O O C C C C C C C C C C C C C C H H H H H H H H H H H H H H H
charge: 0
multiplicity: 1
keywords: wb97x-d3
keywords: def2-TZVPP
keywords: def2/J RIJCOSX
keywords: DEFGRID2
keywords: scfconv7
keywords: smallprint printgap noloewdin
keywords: NOSOSCF
formula: C14H15O2PS2
InChI: InChI=1/C14H15O2PS2/c1-2-16-17(15,18-13-9-5-3-6-10-13)19-14-11-7-4-8-12-14/h3-12H,2H2,1H3
34 atoms
S  0.229939 0.898974 1.593983
S  -0.220675 -0.964663 -1.26237
P  -1.069691 -0.364896 0.5481
O  -2.216152 0.531562 -0.095759
O  -1.434509 -1.459384 1.477233
C  0.394206 2.276434 0.480027
C  0.899964 -2.180126 -0.604841
C  -3.171679 1.264893 0.704902
C  -0.33579 3.434669 0.727374
C  2.237925 -1.855015 -0.413615
C  1.301004 2.229212 -0.572834
C  0.44109 -3.466941 -0.344633
C  -4.317962 0.394966 1.156657
C  -0.16755 4.540726 -0.09243
C  3.118235 -2.822248 0.050108
C  1.455742 3.336311 -1.394073
C  1.327684 -4.426592 0.119515
C  0.722858 4.490919 -1.15615
C  2.663885 -4.10548 0.319603
H  -2.668652 1.721442 1.56027
H  -3.518212 2.068335 0.056806
H  -1.026942 3.477145 1.559105
H  2.595302 -0.856771 -0.628057
H  1.885667 1.337755 -0.751682
H  -0.597487 -3.720169 -0.510786
H  -5.065604 1.023951 1.641745
H  -4.798526 -0.105209 0.315755
H  -4.000395 -0.357426 1.87753
H  -0.732064 5.442686 0.10476
H  4.159378 -2.569416 0.202522
H  2.155302 3.295552 -2.21879
H  0.972462 -5.428052 0.324143
H  0.852309 5.355089 -1.794713
H  3.352032 -4.858003 0.682272
elementType: S P O C H
totalener: -1830.90668648 hartree
nucrepener: 1880.09066971 hartree
electener: -3710.99735619 hartree
oneelecener: -6255.44718863 hartree
twoeener: 2544.44983243 hartree
cpcmener: -0.02752195 hartree
kineticenergy: 1825.73527650 hartree
xcener: -123.393663148319 hartree
chargesum: 0.0000000
charge: -0.143017 -0.138639 0.694564 -0.338468 -0.609659 -0.043385 0.036485 0.047260 -0.058003 -0.112063 -0.027081 -0.114002 -0.248602 -0.218213 -0.181225 -0.247907 -0.171727 -0.071269 -0.111969 0.085235 0.113311 0.154398 0.173331 0.168234 0.140547 0.096125 0.091843 0.082546 0.158361 0.157845 0.154411 0.159127 0.161263 0.160343
qa: -0.1430 -0.1386 0.6946 -0.3385 -0.6097 -0.0434 0.0365 0.0473 -0.0580 -0.1121 -0.0271 -0.1140 -0.2486 -0.2182 -0.1812 -0.2479 -0.1717 -0.0713 -0.1120 0.0852 0.1133 0.1544 0.1733 0.1682 0.1405 0.0961 0.0918 0.0825 0.1584 0.1578 0.1544 0.1591 0.1613 0.1603
va: 2.3207 2.2999 5.4112 2.1025 2.0068 3.7680 3.7571 3.8436 3.8255 3.8500 3.7736 3.9348 3.9474 3.9733 3.9547 4.0132 3.9271 3.8359 3.8710 1.0045 0.9854 0.9921 0.9751 0.9606 1.0047 1.0065 1.0046 1.0189 0.9915 0.9931 0.9962 0.9895 0.9871 0.9884
dispcorr: -0.017548767 hartree
energy: -1830.924235250586
dipole: -4.33855 4.78578 0.44724 5.14547 -3.44693 1.69854 0.10189 -0.84886 -0.74696
magnitude: 1.90867 au
magnitude: 4.85146 debye
