program: Orca
programVersion: 5.0.2
elementType: S S P O O C C C C C C C C C C C C C C H H H H H H H H H H H H H H H
charge: 0
multiplicity: 1
keywords: wb97x-d3
keywords: def2-TZVPP
keywords: def2/J RIJCOSX
keywords: DEFGRID2
keywords: scfconv7
keywords: smallprint printgap noloewdin
keywords: NOSOSCF
formula: C14H15O2PS2
InChI: InChI=1/C14H15O2PS2/c1-2-16-17(15,18-13-9-5-3-6-10-13)19-14-11-7-4-8-12-14/h3-12H,2H2,1H3
34 atoms
S  -0.06872 1.729909 -1.391497
S  0.291022 -1.422371 -1.729794
P  0.288016 0.029642 -0.22015
O  -0.995834 -0.218275 0.691546
O  1.499422 0.087572 0.629046
C  0.150722 2.914131 -0.077764
C  0.486591 -2.832543 -0.655617
C  -2.341945 -0.320652 0.197714
C  1.40303 3.478391 0.13319
C  -0.612937 -3.635321 -0.375855
C  -0.936298 3.278554 0.708265
C  1.73897 -3.135615 -0.133226
C  -3.282108 -0.097862 1.353507
C  1.564364 4.41641 1.142178
C  -0.457631 -4.743555 0.443525
C  -0.7620 4.210235 1.720797
C  1.882203 -4.243159 0.689145
C  0.485773 4.778549 1.937828
C  0.786442 -5.044519 0.980098
H  -2.512386 0.41764 -0.589738
H  -2.485854 -1.311513 -0.235943
H  2.243337 3.191245 -0.484718
H  -1.582612 -3.40089 -0.794595
H  -1.911125 2.84315 0.531573
H  2.5949 -2.517143 -0.366973
H  -4.308879 -0.219786 1.007448
H  -3.112072 -0.82007 2.152402
H  -3.183258 0.90687 1.765171
H  2.537109 4.860082 1.30892
H  -1.312716 -5.368959 0.664357
H  -1.603947 4.492144 2.339434
H  2.853812 -4.478756 1.102945
H  0.61761 5.506355 2.727639
H  0.902982 -5.90659 1.623732
elementType: S P O C H
totalener: -1830.90484336 hartree
nucrepener: 1861.24956300 hartree
electener: -3692.15440636 hartree
oneelecener: -6217.88331197 hartree
twoeener: 2525.72890561 hartree
cpcmener: -0.03008053 hartree
kineticenergy: 1825.73507609 hartree
xcener: -123.391923972847 hartree
chargesum: -0.0000000
charge: -0.163709 -0.156220 0.677617 -0.323267 -0.597946 0.080939 0.070146 0.000488 -0.129956 -0.127568 -0.115607 -0.121315 -0.235592 -0.160581 -0.171582 -0.179376 -0.166894 -0.117578 -0.120788 0.113296 0.116833 0.143438 0.155217 0.156713 0.145964 0.090680 0.092667 0.084956 0.159626 0.159138 0.159229 0.159722 0.160567 0.160743
qa: -0.1637 -0.1562 0.6776 -0.3233 -0.5979 0.0809 0.0701 0.0005 -0.1300 -0.1276 -0.1156 -0.1213 -0.2356 -0.1606 -0.1716 -0.1794 -0.1669 -0.1176 -0.1208 0.1133 0.1168 0.1434 0.1552 0.1567 0.1460 0.0907 0.0927 0.0850 0.1596 0.1591 0.1592 0.1597 0.1606 0.1607
va: 2.2668 2.2728 5.4295 2.0784 2.0227 3.7474 3.7327 3.8230 3.9604 3.9144 3.9128 3.9365 3.9572 3.9264 3.9412 3.9412 3.9335 3.8787 3.8831 1.0006 0.9951 1.0024 0.9966 0.9839 1.0063 1.0056 1.0044 1.0076 0.9889 0.9905 0.9910 0.9895 0.9880 0.9880
dispcorr: -0.016872915 hartree
energy: -1830.921716272377
dipole: -10.52148 8.59481 -1.92667 -1.52560 1.27638 -0.24921 11.25515 -11.00123 0.25392
magnitude: 1.95924 au
magnitude: 4.98000 debye
