program: Orca
programVersion: 5.0.2
elementType: S S P O O C C C C C C C C C C C C C C H H H H H H H H H H H H H H H
charge: 0
multiplicity: 1
keywords: wb97x-d3
keywords: def2-TZVPP
keywords: def2/J RIJCOSX
keywords: DEFGRID2
keywords: scfconv7
keywords: smallprint printgap noloewdin
keywords: NOSOSCF
formula: C14H15O2PS2
InChI: InChI=1/C14H15O2PS2/c1-2-16-17(15,18-13-9-5-3-6-10-13)19-14-11-7-4-8-12-14/h3-12H,2H2,1H3
34 atoms
S  -0.617282 1.715736 -1.291406
S  -0.539648 -1.45298 -1.594264
P  0.22278 0.047081 -0.344071
O  -0.469571 -0.106924 1.082896
O  1.695151 0.046879 -0.188173
C  -0.148099 2.948688 -0.092815
C  0.335324 -2.80106 -0.825667
C  -1.893096 -0.093419 1.293066
C  -1.136763 3.548156 0.679158
C  1.587622 -3.168474 -1.303146
C  1.180485 3.344085 0.021643
C  -0.251465 -3.483381 0.233642
C  -2.176826 -0.708282 2.638585
C  -0.787589 4.542718 1.581502
C  2.255578 -4.230942 -0.712019
C  1.519522 4.330635 0.935795
C  0.428469 -4.539399 0.823125
C  0.538816 4.929991 1.714519
C  1.679761 -4.912846 0.351602
H  -2.244228 0.939102 1.256918
H  -2.398159 -0.648607 0.498683
H  -2.17085 3.244526 0.577123
H  2.036205 -2.632279 -2.128889
H  1.943381 2.894055 -0.599107
H  -1.230458 -3.196337 0.595089
H  -1.668561 -0.171126 3.439892
H  -3.248448 -0.658302 2.8326
H  -1.877004 -1.755917 2.675836
H  -1.555713 5.012037 2.181914
H  3.230167 -4.521633 -1.081595
H  2.553283 4.635951 1.032491
H  -0.021931 -5.070063 1.651571
H  0.80797 5.703346 2.422331
H  2.206824 -5.738262 0.812773
elementType: S P O C H
totalener: -1830.90489798 hartree
nucrepener: 1859.93555774 hartree
electener: -3690.84045572 hartree
oneelecener: -6215.17839626 hartree
twoeener: 2524.33794054 hartree
cpcmener: -0.02951474 hartree
kineticenergy: 1825.72586191 hartree
xcener: -123.390300645543 hartree
chargesum: -0.0000000
charge: -0.150637 -0.163482 0.679658 -0.323628 -0.597506 0.051771 0.086529 0.003007 -0.116937 -0.133541 -0.109563 -0.121800 -0.237570 -0.174614 -0.156675 -0.175044 -0.175090 -0.116963 -0.119594 0.118539 0.111547 0.150511 0.142182 0.146200 0.156090 0.092220 0.091489 0.085290 0.159256 0.159039 0.159743 0.158367 0.160954 0.160249
qa: -0.1506 -0.1635 0.6797 -0.3236 -0.5975 0.0518 0.0865 0.0030 -0.1169 -0.1335 -0.1096 -0.1218 -0.2376 -0.1746 -0.1567 -0.1750 -0.1751 -0.1170 -0.1196 0.1185 0.1115 0.1505 0.1422 0.1462 0.1561 0.0922 0.0915 0.0853 0.1593 0.1590 0.1597 0.1584 0.1610 0.1602
va: 2.2798 2.2687 5.4239 2.0810 2.0218 3.7361 3.7422 3.8251 3.8920 3.9611 3.9269 3.9186 3.9612 3.9421 3.9215 3.9455 3.9361 3.8787 3.8813 0.9923 0.9997 0.9995 1.0034 1.0093 0.9852 1.0048 1.0051 1.0075 0.9901 0.9890 0.9900 0.9913 0.9878 0.9883
dispcorr: -0.016852325 hartree
energy: -1830.921750309170
dipole: -4.55013 2.86296 -1.68717 -2.03745 1.97740 -0.06006 14.91177 -13.72222 1.18955
magnitude: 2.06523 au
magnitude: 5.24941 debye
