program: Orca
programVersion: 5.0.2
elementType: S S P O O C C C C C C C C C C C C C C H H H H H H H H H H H H H H H
charge: 0
multiplicity: 1
keywords: wb97x-d3
keywords: def2-TZVPP
keywords: def2/J RIJCOSX
keywords: DEFGRID2
keywords: scfconv7
keywords: smallprint printgap noloewdin
keywords: NOSOSCF
formula: C14H15O2PS2
InChI: InChI=1/C14H15O2PS2/c1-2-16-17(15,18-13-9-5-3-6-10-13)19-14-11-7-4-8-12-14/h3-12H,2H2,1H3
34 atoms
S  0.236772 1.161181 -1.251466
S  -0.412124 -0.79034 1.472505
P  -1.246181 0.52782 0.074227
O  -2.071571 -0.353435 -0.964696
O  -1.957734 1.595948 0.815124
C  0.940864 2.422927 -0.212315
C  0.264067 -2.035938 0.397587
C  -3.350709 -0.922117 -0.597434
C  2.002833 2.121215 0.631708
C  -0.527502 -3.109182 0.002263
C  0.441817 3.718489 -0.286089
C  1.589603 -1.952127 -0.012775
C  -3.767873 -1.879365 -1.680802
C  2.559087 3.123006 1.414245
C  0.005766 -4.087558 -0.823449
C  1.010835 4.715604 0.491882
C  2.116679 -2.935856 -0.836857
C  2.064391 4.417488 1.34545
C  1.325263 -3.999791 -1.246887
H  -3.264562 -1.435199 0.363689
H  -4.075127 -0.114089 -0.485665
H  2.397065 1.115695 0.678883
H  -1.553302 -3.18485 0.338778
H  -0.379822 3.949543 -0.950348
H  2.209862 -1.126477 0.308067
H  -3.049407 -2.690318 -1.802586
H  -4.728641 -2.32031 -1.413144
H  -3.889161 -1.373063 -2.63874
H  3.380374 2.888196 2.078304
H  -0.611851 -4.91946 -1.135909
H  0.626982 5.725645 0.432336
H  3.14733 -2.867514 -1.159468
H  2.501705 5.197257 1.955711
H  1.737666 -4.763414 -1.893718
elementType: S P O C H
totalener: -1830.90769381 hartree
nucrepener: 1884.13388212 hartree
electener: -3715.04157593 hartree
oneelecener: -6263.47708912 hartree
twoeener: 2548.43551319 hartree
cpcmener: -0.02840971 hartree
kineticenergy: 1825.73623326 hartree
xcener: -123.392684426588 hartree
chargesum: -0.0000000
charge: -0.142852 -0.145780 0.690237 -0.334665 -0.611589 0.026766 -0.003344 -0.007743 -0.075785 -0.091965 -0.101400 -0.075216 -0.233680 -0.216899 -0.197187 -0.183846 -0.215053 -0.094404 -0.089468 0.109360 0.127106 0.169990 0.156977 0.139674 0.180483 0.084175 0.091275 0.092411 0.155901 0.159016 0.158911 0.156375 0.161043 0.161177
qa: -0.1429 -0.1458 0.6902 -0.3347 -0.6116 0.0268 -0.0033 -0.0077 -0.0758 -0.0920 -0.1014 -0.0752 -0.2337 -0.2169 -0.1972 -0.1838 -0.2151 -0.0944 -0.0895 0.1094 0.1271 0.1700 0.1570 0.1397 0.1805 0.0842 0.0913 0.0924 0.1559 0.1590 0.1589 0.1564 0.1610 0.1612
va: 2.2973 2.3076 5.4119 2.1019 2.0072 3.7388 3.7729 3.8356 3.8193 3.8758 3.9324 3.8151 3.9395 3.9925 3.9493 3.9403 3.9828 3.8520 3.8577 0.9959 1.0031 0.9750 0.9812 1.0030 0.9634 1.0060 1.0066 1.0040 0.9949 0.9915 0.9896 0.9943 0.9877 0.9872
dispcorr: -0.017947367 hartree
energy: -1830.925641176496
dipole: -2.70362 3.42496 0.72134 -7.59725 6.08318 -1.51408 -4.41915 3.73511 -0.68404
magnitude: 1.81126 au
magnitude: 4.60386 debye
